{"text_format":"1","workbook":"xlsx","n_sheets":9,"sheets":["Instructions","INPUT","Print_Tag","Printout","Feed Ingredients","Old_to_New_Feed_Ingredient_Conv","Calculation Sheet","Min_Max","Drug_Calc2"],"not_rendered":{"charts":0,"images":0,"macros":0,"external_links":0,"defined_names":8,"comments":2,"pivot_tables":0},"unopened":[],"bounds":{"document_bytes":16777216,"sheet_cells":100000,"rows_first":2000,"rows_last":500,"rows_between":2000,"halvings":0,"cell_chars":16384,"cell_head_chars":4096},"cells_cut":0,"cells_raw":0,"read":"whole","date_system":"1900"}

{"sheet":"Instructions","index":0,"n_rows":33,"n_cols":5,"rows_kept":33,"cut":false,"hidden":false,"merged":[]}
["Basic instructions for use of the feed caclulation program"]
[]
["Adding new feedstuffs"]
[null,"New feed ingredients may be added to the Feed Ingredients sheet by inserting lines or replacing blank feeds."]
[null,"If you have ingredients in the pre-2018 version of the calculator that you wish to convert to the new format, copy"]
[null,"the ingredients into the Old_to_New_Feed_Ingredient_Calc sheet and paste the converted values into the"]
[null,"Feed Ingredients sheet (as values)."]
["Nutrient Values"]
[null,"Non-protein nitrogen (NPN) is entered as equivalent CP from NPN."]
[null,"Lysine can be estimated by using 4% of the crude protein value."]
{"$rows_left_out":24}
{"sheet":"INPUT","index":1,"n_rows":129,"n_cols":9,"rows_kept":129,"cut":false,"hidden":false,"merged":[]}
[null,"Insp #",null,null,null,{"$f":"TODAY()","v":"2022-06-14"},null,"Select feed type from menu"]
[null,"Manf name",null,null,"Big Blue Feed Mill",null,null,null,"Beef Feed"]
[null,"Product name",null,null,"Custom Beef Mix",{"$f":"Print_Tag!H3","v":" "},null,"Feed rate (lbs)",5]
[]
[null,null,null,null,"Ingredients Selected","Amount lbs"]
[null,{"$f":"'Feed Ingredients'!A2","v":"Alfalfa Meal"},null,1,{"$f":"IF(ISERROR(VLOOKUP(D6,A$6:B$129,2,0)),\"No feed\",(VLOOKUP(D6,A$6:B$129,2,0)))","v":"Corn (7% CP)"},725,null,"Crude Protein %",{"$f":"Printout!B6","v":15.842499999999999}]
[null,{"$f":"'Feed Ingredients'!A3","v":"Ammonium Chloride"},null,{"$f":"D6+1","v":2},"Corn Gluten Feed (18% CP)",300,null,"NPN %",{"$f":"Printout!B7","v":0}]
[null,{"$f":"'Feed Ingredients'!A4","v":"Bakery Byproduct"},null,{"$f":"D7+1","v":3},"Distillers DG w/sol Beverage",300,null,"Lysine %",{"$f":"Printout!B8","v":0.69450000000000001}]
[null,{"$f":"'Feed Ingredients'!A5","v":"Barley"},null,4,"Soy Hulls",400,null,"Methionine %",{"$f":"Printout!B9","v":0.39165}]
[null,{"$f":"'Feed Ingredients'!A6","v":"Beet Pulp"},null,5,"Soybean Meal 46.5",200,null,"Crude Fat %",{"$f":"Printout!B10","v":3.8497499999999998}]
{"$rows_left_out":120}
{"sheet":"Print_Tag","index":2,"n_rows":37,"n_cols":11,"rows_kept":37,"cut":false,"hidden":false,"merged":[[3,2,4,2],[3,1,4,1],[3,4,4,4],[3,13,4,13]]}
["Insp. No.:",null,{"$f":"INPUT!E1","v":0}]
["Manuf. Name:",null,{"$f":"INPUT!E2","v":"Big Blue Feed Mill"},null,null,null,null,{"$f":"INPUT!E3","v":"Custom Beef Mix"}]
["Total Pounds",null,{"$f":"'Calculation Sheet'!A4","v":2000},null,null,null,null,{"$f":"IF(B32=\"Yes\",\"Medicated\",\" \")","v":" "}]
[null,"All Calculated Nutrients",{"$f":"INPUT!I2","v":"Beef Feed"},null,{"$f":"C4","v":"Beef Feed"},"Tag"]
["GUARANTEES",null,null,null,null,"Guarantees","Adjust"]
["Crude Protein %",{"$f":"Printout!B6","v":15.842499999999999},{"$f":"IF(E6>0,E6,\" \")","v":15.842499999999999},null,{"$f":"HLOOKUP(C$4,Printout!$C$4:$O$30,3,0)","v":15.842499999999999},{"$f":"IF(E6>0,A6,\" \")","v":"Crude Protein %"},-0.1,{"$f":"IF(F6=A6,(ROUND((C6+G6),1)),\" \")","v":15.7},{"$f":"IF(F6=A6,\"Min\",\" \")","v":"Min"}]
["NPN %",{"$f":"Printout!B7","v":0},{"$f":"IF(E7>0,E7,\" \")","v":" "},null,{"$f":"HLOOKUP(C$4,Printout!$C$4:$O$30,4,0)","v":0},{"$f":"IF(E7>0,A7,\" \")","v":" "},0.2,{"$f":"IF(F7=A7,(ROUND((C7+G7),1)),\" \")","v":" "},{"$f":"IF(F7=A7,\"Max\",\" \")","v":" "}]
["Lysine %",{"$f":"Printout!B8","v":0.69450000000000001}," ",null,{"$f":"HLOOKUP(C$4,Printout!$C$4:$O$30,5,0)","v":0}," ",0,{"$f":"IF(F8=A8,(ROUND((C8+G8),1)),\" \")","v":" "}," "]
["Methionine %",{"$f":"Printout!B9","v":0.39165}," ",null,{"$f":"HLOOKUP(C$4,Printout!$C$4:$O$30,6,0)","v":0}," ",0,{"$f":"IF(F9=A9,(ROUND((C9+G9),1)),\" \")","v":" "}," "]
["Crude Fat %",{"$f":"Printout!B10","v":3.8497499999999998},3.8497499999999998,null,{"$f":"HLOOKUP(C$4,Printout!$C$4:$O$30,7,0)","v":3.8497499999999998},"Crude Fat %",-0.1,{"$f":"IF(F10=A10,(ROUND((C10+G10),1)),\" \")","v":3.7},"Min"]
{"$rows_left_out":28}
{"sheet":"Printout","index":3,"n_rows":48,"n_cols":15,"rows_kept":48,"cut":false,"hidden":false,"merged":[[3,2,4,2],[3,3,4,3],[3,4,4,4],[3,5,4,5],[3,11,4,11],[3,12,4,12],[3,13,4,13],[3,14,4,14],[3,6,4,6],[3,7,4,7],[3,8,4,8],[3,9,4,9],[3,10,4,10]]}
["Insp. No.:",{"$f":"Print_Tag!C1","v":0},null,"Product:",{"$f":"Print_Tag!H2","v":"Custom Beef Mix"}]
["Manuf. Name:",{"$f":"Print_Tag!C2","v":"Big Blue Feed Mill"}]
["Total Pounds",{"$f":"'Calculation Sheet'!A4","v":2000},null,null,null,"Complete Feeds and Supplements"]
[null,null,"Beef Feed","Dairy Feed","Equine Feed","Swine Feed","Poultry Feed","Goat Feed","Sheep Feed","Rabbit Feed","Fish Feed","Deer Feed","Deer Mineral","Mineral Feed","Milk Replacer"]
["GUARANTEES","MIX"]
["Crude Protein %",{"$f":"'Calculation Sheet'!C6","v":15.842499999999999},{"$f":"$B$6","v":15.842499999999999},{"$f":"$B$6","v":15.842499999999999},15.842499999999999,15.842499999999999,15.842499999999999,15.842499999999999,15.842499999999999,15.842499999999999,15.842499999999999,15.842499999999999,null,null,15.842499999999999]
["NPN %",{"$f":"'Calculation Sheet'!D6","v":0},{"$f":"$B$7","v":0},{"$f":"$B$7","v":0},null,null,null,{"$f":"$B$7","v":0},{"$f":"$B$7","v":0}]
["Lysine %",{"$f":"'Calculation Sheet'!E6","v":0.69450000000000001},null,null,null,{"$f":"$B$8","v":0.69450000000000001},{"$f":"$B$8","v":0.69450000000000001}]
["Methionine %",{"$f":"'Calculation Sheet'!F6","v":0.39165},null,null,null,null,{"$f":"$B$9","v":0.39165}]
["Crude Fat %",{"$f":"'Calculation Sheet'!G6","v":3.8497499999999998},{"$f":"$B$10","v":3.8497499999999998},{"$f":"$B$10","v":3.8497499999999998},3.8497499999999998,3.8497499999999998,3.8497499999999998,3.8497499999999998,3.8497499999999998,3.8497499999999998,3.8497499999999998,3.8497499999999998,null,null,3.8497499999999998]
{"$rows_left_out":39}
{"sheet":"Feed Ingredients","index":4,"n_rows":125,"n_cols":34,"rows_kept":125,"cut":false,"hidden":false,"merged":[]}
[null,"Crude protein %","NPN %","Lysine %","Methionine %","CrudeFat %","Crude Fiber %","ADF %","NDF %","Ca %","P %","Salt %","Na %","Mg %","K %","S %","Cu ppm","Se ppm","Zn ppm","Fe ppm","Mn ppm","Co ppm","I ppm","Vit A IU/lb","Vit D IU/lb","Vit E IU/lb","Moisture %","CTC g/ton","Sulfamethazine g/ton","Monensin g/ton","Lasalocid g/ton","Deccox g/ton","Bacitracin g/ton","Amprolium g/ton"]
["Alfalfa Meal",17,null,0.73,0.28000000000000003,2.75,25,35,45,1.3,0.23,null,0.08,0.28999999999999998,2.2999999999999998,0.2,10,null,21,400,35,null,null,null,null,null,10]
["Ammonium Chloride",160,160,0,0,0,0,0,0,0,0,null,null,0,0,null,0,0,0,null,null,null,null,0,0,0]
["Bakery Byproduct",12,null,0.3,0.16,9,2.5,7,12,0.1,0.25,null,1.1000000000000001,0.3,0.1,0.02,5,null,15,50,60,0.5,null,null,null,null,8]
["Barley",10.5,null,0.4,0.12,1.8,4,6,17,7.0000000000000007E-2,0.36,null,0.03,0.13,0.44,0.15,8,null,20,80,16,0.1,null,null,null,null,10]
["Beet Pulp",8,null,0.6,0.01,0.5,21,24,38,0.6,0.1,null,0.19,0.27,0.21,0.2,13,null,1,300,35,0.8,null,null,null,null,9]
["Biuret",218,218,null,null,null,null,null,null,null,null,null,null,null,null,null,null,null,null,null,null,null,null,null,null,null,5]
["Calcium Carbonate",null,null,null,null,null,null,null,null,38,null,null,null,null,null,null,null,null,null,null,null,null,null,null,null,null,5]
["Cane Molasses",3,null,0.3,0.01,0.02,0.5,0.4,0.7,0.82,0.08,null,0.16,0.36,2.38,0.47,59,null,21,200,42,null,null,null,null,null,26]
["Cane Molasses (Dried)",7,null,0.3,0.01,0.4,6,8,10,1.1000000000000001,0.14000000000000001,null,0.2,0.4,3.4,0.57999999999999996,70,null,28,250,52,null,null,null,null,null,9]
{"$rows_left_out":116}
{"sheet":"Old_to_New_Feed_Ingredient_Conv","index":5,"n_rows":40,"n_cols":34,"rows_kept":40,"cut":false,"hidden":false,"merged":[]}
["Old ingredient format","% Protein","% NPN","% Lysine","% Fat","% Fiber","% ADF","% Ca","% Phos","% Salt","% Mg","% K","Cu ppm","Sel. ppm","Zn ppm","Meth.","Vit.A IU/lb","Vit.D IU/lb","Vit.E IU/lb"]
["Alfalfa Hay",15,null,0.6,1.7,29,39,1.25,0.2,null,0.22,1.75,10,null,20,0.2]
["Alfalfa Meal",17,null,0.73,2.75,25,35,1.3,0.23,null,0.28999999999999998,2.2999999999999998,10,null,21,0.22]
["Barley",11,null,0.4,1.8,6,7,7.0000000000000007E-2,0.36,null,0.13,0.44,8,null,20,0.12]
[]
[]
[]
[]
[]
[]
{"$rows_left_out":31}
{"sheet":"Calculation Sheet","index":6,"n_rows":36,"n_cols":36,"rows_kept":36,"cut":false,"hidden":false,"merged":[]}
[]
[]
[]
[{"$f":"SUM(A7:A37)","v":2000},null,2,{"$f":"C4+1","v":3},{"$f":"D4+1","v":4},5,6,7,8,9,10,11,12,13,14,15,16,17,18,19,20,21,22,23,24,25,26,{"$f":"AA4+2","v":28},{"$f":"AB4+1","v":29},{"$f":"AC4+1","v":30},{"$f":"AD4+1","v":31},{"$f":"AE4+1","v":32},{"$f":"AF4+1","v":33},34,null,27]
["Calculated Values",null,{"$f":"'Feed Ingredients'!B1","v":"Crude protein %"},{"$f":"'Feed Ingredients'!C1","v":"NPN %"},{"$f":"'Feed Ingredients'!D1","v":"Lysine %"},{"$f":"'Feed Ingredients'!E1","v":"Methionine %"},{"$f":"'Feed Ingredients'!F1","v":"CrudeFat %"},{"$f":"'Feed Ingredients'!G1","v":"Crude Fiber %"},{"$f":"'Feed Ingredients'!H1","v":"ADF %"},{"$f":"'Feed Ingredients'!I1","v":"NDF %"},{"$f":"'Feed Ingredients'!J1","v":"Ca %"},{"$f":"'Feed Ingredients'!K1","v":"P %"},{"$f":"'Feed Ingredients'!L1","v":"Salt %"},{"$f":"'Feed Ingredients'!M1","v":"Na %"},{"$f":"'Feed Ingredients'!N1","v":"Mg %"},{"$f":"'Feed Ingredients'!O1","v":"K %"},{"$f":"'Feed Ingredients'!P1","v":"S %"},{"$f":"'Feed Ingredients'!Q1","v":"Cu ppm"},{"$f":"'Feed Ingredients'!R1","v":"Se ppm"},{"$f":"'Feed Ingredients'!S1","v":"Zn ppm"},{"$f":"'Feed Ingredients'!T1","v":"Fe ppm"},{"$f":"'Feed Ingredients'!U1","v":"Mn ppm"},{"$f":"'Feed Ingredients'!V1","v":"Co ppm"},{"$f":"'Feed Ingredients'!W1","v":"I ppm"},{"$f":"'Feed Ingredients'!X1","v":"Vit A IU/lb"},{"$f":"'Feed Ingredients'!Y1","v":"Vit D IU/lb"},{"$f":"'Feed Ingredients'!Z1","v":"Vit E IU/lb"},{"$f":"'Feed Ingredients'!AB1","v":"CTC g/ton"},{"$f":"'Feed Ingredients'!AC1","v":"Sulfamethazine g/ton"},{"$f":"'Feed Ingredients'!AD1","v":"Monensin g/ton"},{"$f":"'Feed Ingredients'!AE1","v":"Lasalocid g/ton"},{"$f":"'Feed Ingredients'!AF1","v":"Deccox g/ton"},{"$f":"'Feed Ingredients'!AG1","v":"Bacitracin g/ton"},{"$f":"'Feed Ingredients'!AH1","v":"Amprolium g/ton"},null,{"$f":"'Feed Ingredients'!AA1","v":"Moisture %"}]
["Pounds","Ingredients",{"$f":"(($A$7*C7)+($A$8*C8)+($A$9*C9)+($A$10*C10)+($A$11*C11)+($A$12*C12)+($A$13*C13)+($A$14*C14)+($A$15*C15)+($A$16*C16)+($A$17*C17)+($A$18*C18)+($A$19*C19)+($A$20*C20)+($A$21*C21)+($A$22*C22)+($A$23*C23)+($A$24*C24)+($A$25*C25)+($A$26*C26)+($A$27*C27)+($A$28*C28)+($A$29*C29)+($A$30*C30)+($A$31*C31)+($A$32*C32)+($A$33*C33)+($A$34*C34)+($A$35*C35)+($A$36*C36)+($A$37*C37))/$A4","v":15.842499999999999},{"$f":"(($A$7*D7)+($A$8*D8)+($A$9*D9)+($A$10*D10)+($A$11*D11)+($A$12*D12)+($A$13*D13)+($A$14*D14)+($A$15*D15)+($A$16*D16)+($A$17*D17)+($A$18*D18)+($A$19*D19)+($A$20*D20)+($A$21*D21)+($A$22*D22)+($A$23*D23)+($A$24*D24)+($A$25*D25)+($A$26*D26)+($A$27*D27)+($A$28*D28)+($A$29*D29)+($A$30*D30)+($A$31*D31)+($A$32*D32)+($A$33*D33)+($A$34*D34)+($A$35*D35)+($A$36*D36)+($A$37*D37))/$A4","v":0},0.69450000000000001,0.39165,3.8497499999999998,10.435,15.938750000000001,26.643750000000001,0.66962500000000003,0.400225,0.99124999999999996,0.43245775000000003,0.1525,0.78349999999999997,0.13069999999999998,11.5375,0,48.457500000000003,172.16249999999999,23.905000000000001,0.26424999999999998,0,0,0,0,0,0,0,0,0,0,0,null,{"$f":"(($A$7*AJ7)+($A$8*AJ8)+($A$9*AJ9)+($A$10*AJ10)+($A$11*AJ11)+($A$12*AJ12)+($A$13*AJ13)+($A$14*AJ14)+($A$15*AJ15)+($A$16*AJ16)+($A$17*AJ17)+($A$18*AJ18)+($A$19*AJ19)+($A$20*AJ20)+($A$21*AJ21)+($A$22*AJ22)+($A$23*AJ23)+($A$24*AJ24)+($A$25*AJ25)+($A$26*AJ26)+($A$27*AJ27)+($A$28*AJ28)+($A$29*AJ29)+($A$30*AJ30)+($A$31*AJ31)+($A$32*AJ32)+($A$33*AJ33)+($A$34*AJ34)+($A$35*AJ35)+($A$36*AJ36)+($A$37*AJ37))/$A4","v":10.547499999999999}]
[{"$f":"INPUT!F6","v":725},{"$f":"INPUT!E6","v":"Corn (7% CP)"},{"$f":"VLOOKUP($B7,'Feed Ingredients'!$A$2:$AA$125,(C$4), FALSE)","v":7},{"$f":"VLOOKUP($B7,'Feed Ingredients'!$A$2:$AA$125,(D$4), FALSE)","v":0},{"$f":"VLOOKUP($B7,'Feed Ingredients'!$A$2:$AA$125,(E$4), FALSE)","v":0.24},{"$f":"VLOOKUP($B7,'Feed Ingredients'!$A$2:$AA$125,(F$4), FALSE)","v":0.2},{"$f":"VLOOKUP($B7,'Feed Ingredients'!$A$2:$AA$125,(G$4), FALSE)","v":3.5},{"$f":"VLOOKUP($B7,'Feed Ingredients'!$A$2:$AA$125,(H$4), FALSE)","v":2},{"$f":"VLOOKUP($B7,'Feed Ingredients'!$A$2:$AA$125,(I$4), FALSE)","v":3.5},{"$f":"VLOOKUP($B7,'Feed Ingredients'!$A$2:$AA$125,(J$4), FALSE)","v":9.5},{"$f":"VLOOKUP($B7,'Feed Ingredients'!$A$2:$AA$125,(K$4), FALSE)","v":0.01},{"$f":"VLOOKUP($B7,'Feed Ingredients'!$A$2:$AA$125,(L$4), FALSE)","v":0.25},{"$f":"VLOOKUP($B7,'Feed Ingredients'!$A$2:$AA$125,(M$4), FALSE)","v":0},{"$f":"VLOOKUP($B7,'Feed Ingredients'!$A$2:$AA$125,(N$4), FALSE)","v":0},{"$f":"VLOOKUP($B7,'Feed Ingredients'!$A$2:$AA$125,(O$4), FALSE)","v":0.08},{"$f":"VLOOKUP($B7,'Feed Ingredients'!$A$2:$AA$125,(P$4), FALSE)","v":0.32},{"$f":"VLOOKUP($B7,'Feed Ingredients'!$A$2:$AA$125,(Q$4), FALSE)","v":0.08},{"$f":"VLOOKUP($B7,'Feed Ingredients'!$A$2:$AA$125,(R$4), FALSE)","v":3},{"$f":"VLOOKUP($B7,'Feed Ingredients'!$A$2:$AA$125,(S$4), FALSE)","v":0},{"$f":"VLOOKUP($B7,'Feed Ingredients'!$A$2:$AA$125,(T$4), FALSE)","v":19},{"$f":"VLOOKUP($B7,'Feed Ingredients'!$A$2:$AA$125,(U$4), FALSE)","v":37},{"$f":"VLOOKUP($B7,'Feed Ingredients'!$A$2:$AA$125,(V$4), FALSE)","v":6},{"$f":"VLOOKUP($B7,'Feed Ingredients'!$A$2:$AA$125,(W$4), FALSE)","v":0.1},{"$f":"VLOOKUP($B7,'Feed Ingredients'!$A$2:$AA$125,(X$4), FALSE)","v":0},{"$f":"VLOOKUP($B7,'Feed Ingredients'!$A$2:$AA$125,(Y$4), FALSE)","v":0},{"$f":"VLOOKUP($B7,'Feed Ingredients'!$A$2:$AA$125,(Z$4), FALSE)","v":0},{"$f":"VLOOKUP($B7,'Feed Ingredients'!$A$2:$AH$125,(AA$4), FALSE)","v":0},{"$f":"VLOOKUP($B7,'Feed Ingredients'!$A$2:$AH$125,(AB$4), FALSE)","v":0},{"$f":"VLOOKUP($B7,'Feed Ingredients'!$A$2:$AH$125,(AC$4), FALSE)","v":0},{"$f":"VLOOKUP($B7,'Feed Ingredients'!$A$2:$AH$125,(AD$4), FALSE)","v":0},{"$f":"VLOOKUP($B7,'Feed Ingredients'!$A$2:$AH$125,(AE$4), FALSE)","v":0},{"$f":"VLOOKUP($B7,'Feed Ingredients'!$A$2:$AH$125,(AF$4), FALSE)","v":0},{"$f":"VLOOKUP($B7,'Feed Ingredients'!$A$2:$AH$125,(AG$4), FALSE)","v":0},{"$f":"VLOOKUP($B7,'Feed Ingredients'!$A$2:$AH$125,(AH$4), FALSE)","v":0},null,{"$f":"VLOOKUP($B7,'Feed Ingredients'!$A$2:$AH$125,(AJ$4), FALSE)","v":12}]
[{"$f":"INPUT!F7","v":300},{"$f":"INPUT!E7","v":"Corn Gluten Feed (18% CP)"},{"$f":"VLOOKUP($B8,'Feed Ingredients'!$A$2:$AA$125,(C$4), FALSE)","v":18},{"$f":"VLOOKUP($B8,'Feed Ingredients'!$A$2:$AA$125,(D$4), FALSE)","v":0},{"$f":"VLOOKUP($B8,'Feed Ingredients'!$A$2:$AA$125,(E$4), FALSE)","v":0.6},{"$f":"VLOOKUP($B8,'Feed Ingredients'!$A$2:$AA$125,(F$4), FALSE)","v":0.5},{"$f":"VLOOKUP($B8,'Feed Ingredients'!$A$2:$AA$125,(G$4), FALSE)","v":3},{"$f":"VLOOKUP($B8,'Feed Ingredients'!$A$2:$AA$125,(H$4), FALSE)","v":8},{"$f":"VLOOKUP($B8,'Feed Ingredients'!$A$2:$AA$125,(I$4), FALSE)","v":11},{"$f":"VLOOKUP($B8,'Feed Ingredients'!$A$2:$AA$125,(J$4), FALSE)","v":33},{"$f":"VLOOKUP($B8,'Feed Ingredients'!$A$2:$AA$125,(K$4), FALSE)","v":0.15},{"$f":"VLOOKUP($B8,'Feed Ingredients'!$A$2:$AA$125,(L$4), FALSE)","v":0.75},{"$f":"VLOOKUP($B8,'Feed Ingredients'!$A$2:$AA$125,(M$4), FALSE)","v":0},{"$f":"VLOOKUP($B8,'Feed Ingredients'!$A$2:$AA$125,(N$4), FALSE)","v":0},{"$f":"VLOOKUP($B8,'Feed Ingredients'!$A$2:$AA$125,(O$4), FALSE)","v":0.28999999999999998},{"$f":"VLOOKUP($B8,'Feed Ingredients'!$A$2:$AA$125,(P$4), FALSE)","v":0.6},{"$f":"VLOOKUP($B8,'Feed Ingredients'!$A$2:$AA$125,(Q$4), FALSE)","v":0.16},{"$f":"VLOOKUP($B8,'Feed Ingredients'!$A$2:$AA$125,(R$4), FALSE)","v":5},{"$f":"VLOOKUP($B8,'Feed Ingredients'!$A$2:$AA$125,(S$4), FALSE)","v":0},{"$f":"VLOOKUP($B8,'Feed Ingredients'!$A$2:$AA$125,(T$4), FALSE)","v":65},{"$f":"VLOOKUP($B8,'Feed Ingredients'!$A$2:$AA$125,(U$4), FALSE)","v":160},{"$f":"VLOOKUP($B8,'Feed Ingredients'!$A$2:$AA$125,(V$4), FALSE)","v":24},{"$f":"VLOOKUP($B8,'Feed Ingredients'!$A$2:$AA$125,(W$4), FALSE)","v":0},{"$f":"VLOOKUP($B8,'Feed Ingredients'!$A$2:$AA$125,(X$4), FALSE)","v":0},{"$f":"VLOOKUP($B8,'Feed Ingredients'!$A$2:$AA$125,(Y$4), FALSE)","v":0},{"$f":"VLOOKUP($B8,'Feed Ingredients'!$A$2:$AA$125,(Z$4), FALSE)","v":0},{"$f":"VLOOKUP($B8,'Feed Ingredients'!$A$2:$AH$125,(AA$4), FALSE)","v":0},{"$f":"VLOOKUP($B8,'Feed Ingredients'!$A$2:$AH$125,(AB$4), FALSE)","v":0},{"$f":"VLOOKUP($B8,'Feed Ingredients'!$A$2:$AH$125,(AC$4), FALSE)","v":0},{"$f":"VLOOKUP($B8,'Feed Ingredients'!$A$2:$AH$125,(AD$4), FALSE)","v":0},{"$f":"VLOOKUP($B8,'Feed Ingredients'!$A$2:$AH$125,(AE$4), FALSE)","v":0},{"$f":"VLOOKUP($B8,'Feed Ingredients'!$A$2:$AH$125,(AF$4), FALSE)","v":0},{"$f":"VLOOKUP($B8,'Feed Ingredients'!$A$2:$AH$125,(AG$4), FALSE)","v":0},{"$f":"VLOOKUP($B8,'Feed Ingredients'!$A$2:$AH$125,(AH$4), FALSE)","v":0},null,{"$f":"VLOOKUP($B8,'Feed Ingredients'!$A$2:$AH$125,(AJ$4), FALSE)","v":10}]
[{"$f":"INPUT!F8","v":300},{"$f":"INPUT!E8","v":"Distillers DG w/sol Beverage"},{"$f":"VLOOKUP($B9,'Feed Ingredients'!$A$2:$AA$125,(C$4), FALSE)","v":25},{"$f":"VLOOKUP($B9,'Feed Ingredients'!$A$2:$AA$125,(D$4), FALSE)","v":0},{"$f":"VLOOKUP($B9,'Feed Ingredients'!$A$2:$AA$125,(E$4), FALSE)","v":0.6},{"$f":"VLOOKUP($B9,'Feed Ingredients'!$A$2:$AA$125,(F$4), FALSE)","v":1},{"$f":"VLOOKUP($B9,'Feed Ingredients'!$A$2:$AA$125,(G$4), FALSE)","v":9},{"$f":"VLOOKUP($B9,'Feed Ingredients'!$A$2:$AA$125,(H$4), FALSE)","v":8},{"$f":"VLOOKUP($B9,'Feed Ingredients'!$A$2:$AA$125,(I$4), FALSE)","v":18},{"$f":"VLOOKUP($B9,'Feed Ingredients'!$A$2:$AA$125,(J$4), FALSE)","v":34},{"$f":"VLOOKUP($B9,'Feed Ingredients'!$A$2:$AA$125,(K$4), FALSE)","v":0.08},{"$f":"VLOOKUP($B9,'Feed Ingredients'!$A$2:$AA$125,(L$4), FALSE)","v":0.64},{"$f":"VLOOKUP($B9,'Feed Ingredients'!$A$2:$AA$125,(M$4), FALSE)","v":0},{"$f":"VLOOKUP($B9,'Feed Ingredients'!$A$2:$AA$125,(N$4), FALSE)","v":0.03},{"$f":"VLOOKUP($B9,'Feed Ingredients'!$A$2:$AA$125,(O$4), FALSE)","v":0.18},{"$f":"VLOOKUP($B9,'Feed Ingredients'!$A$2:$AA$125,(P$4), FALSE)","v":0.63},{"$f":"VLOOKUP($B9,'Feed Ingredients'!$A$2:$AA$125,(Q$4), FALSE)","v":0.3},{"$f":"VLOOKUP($B9,'Feed Ingredients'!$A$2:$AA$125,(R$4), FALSE)","v":20},{"$f":"VLOOKUP($B9,'Feed Ingredients'!$A$2:$AA$125,(S$4), FALSE)","v":0},{"$f":"VLOOKUP($B9,'Feed Ingredients'!$A$2:$AA$125,(T$4), FALSE)","v":81},{"$f":"VLOOKUP($B9,'Feed Ingredients'!$A$2:$AA$125,(U$4), FALSE)","v":180},{"$f":"VLOOKUP($B9,'Feed Ingredients'!$A$2:$AA$125,(V$4), FALSE)","v":29},{"$f":"VLOOKUP($B9,'Feed Ingredients'!$A$2:$AA$125,(W$4), FALSE)","v":0.22},{"$f":"VLOOKUP($B9,'Feed Ingredients'!$A$2:$AA$125,(X$4), FALSE)","v":0},{"$f":"VLOOKUP($B9,'Feed Ingredients'!$A$2:$AA$125,(Y$4), FALSE)","v":0},{"$f":"VLOOKUP($B9,'Feed Ingredients'!$A$2:$AA$125,(Z$4), FALSE)","v":0},{"$f":"VLOOKUP($B9,'Feed Ingredients'!$A$2:$AH$125,(AA$4), FALSE)","v":0},{"$f":"VLOOKUP($B9,'Feed Ingredients'!$A$2:$AH$125,(AB$4), FALSE)","v":0},{"$f":"VLOOKUP($B9,'Feed Ingredients'!$A$2:$AH$125,(AC$4), FALSE)","v":0},{"$f":"VLOOKUP($B9,'Feed Ingredients'!$A$2:$AH$125,(AD$4), FALSE)","v":0},{"$f":"VLOOKUP($B9,'Feed Ingredients'!$A$2:$AH$125,(AE$4), FALSE)","v":0},{"$f":"VLOOKUP($B9,'Feed Ingredients'!$A$2:$AH$125,(AF$4), FALSE)","v":0},{"$f":"VLOOKUP($B9,'Feed Ingredients'!$A$2:$AH$125,(AG$4), FALSE)","v":0},{"$f":"VLOOKUP($B9,'Feed Ingredients'!$A$2:$AH$125,(AH$4), FALSE)","v":0},null,{"$f":"VLOOKUP($B9,'Feed Ingredients'!$A$2:$AH$125,(AJ$4), FALSE)","v":9}]
[{"$f":"INPUT!F9","v":400},{"$f":"INPUT!E9","v":"Soy Hulls"},{"$f":"VLOOKUP($B10,'Feed Ingredients'!$A$2:$AA$125,(C$4), FALSE)","v":10.5},{"$f":"VLOOKUP($B10,'Feed Ingredients'!$A$2:$AA$125,(D$4), FALSE)","v":0},{"$f":"VLOOKUP($B10,'Feed Ingredients'!$A$2:$AA$125,(E$4), FALSE)","v":0.54},{"$f":"VLOOKUP($B10,'Feed Ingredients'!$A$2:$AA$125,(F$4), FALSE)","v":0.12},{"$f":"VLOOKUP($B10,'Feed Ingredients'!$A$2:$AA$125,(G$4), FALSE)","v":2.5},{"$f":"VLOOKUP($B10,'Feed Ingredients'!$A$2:$AA$125,(H$4), FALSE)","v":34},{"$f":"VLOOKUP($B10,'Feed Ingredients'!$A$2:$AA$125,(I$4), FALSE)","v":47},{"$f":"VLOOKUP($B10,'Feed Ingredients'!$A$2:$AA$125,(J$4), FALSE)","v":59},{"$f":"VLOOKUP($B10,'Feed Ingredients'!$A$2:$AA$125,(K$4), FALSE)","v":0.5},{"$f":"VLOOKUP($B10,'Feed Ingredients'!$A$2:$AA$125,(L$4), FALSE)","v":0.17},{"$f":"VLOOKUP($B10,'Feed Ingredients'!$A$2:$AA$125,(M$4), FALSE)","v":0},{"$f":"VLOOKUP($B10,'Feed Ingredients'!$A$2:$AA$125,(N$4), FALSE)","v":0.17},{"$f":"VLOOKUP($B10,'Feed Ingredients'!$A$2:$AA$125,(O$4), FALSE)","v":0.1},{"$f":"VLOOKUP($B10,'Feed Ingredients'!$A$2:$AA$125,(P$4), FALSE)","v":1.1599999999999999},{"$f":"VLOOKUP($B10,'Feed Ingredients'!$A$2:$AA$125,(Q$4), FALSE)","v":0.12},{"$f":"VLOOKUP($B10,'Feed Ingredients'!$A$2:$AA$125,(R$4), FALSE)","v":17},{"$f":"VLOOKUP($B10,'Feed Ingredients'!$A$2:$AA$125,(S$4), FALSE)","v":0},{"$f":"VLOOKUP($B10,'Feed Ingredients'!$A$2:$AA$125,(T$4), FALSE)","v":30},{"$f":"VLOOKUP($B10,'Feed Ingredients'!$A$2:$AA$125,(U$4), FALSE)","v":450},{"$f":"VLOOKUP($B10,'Feed Ingredients'!$A$2:$AA$125,(V$4), FALSE)","v":20},{"$f":"VLOOKUP($B10,'Feed Ingredients'!$A$2:$AA$125,(W$4), FALSE)","v":0.1},{"$f":"VLOOKUP($B10,'Feed Ingredients'!$A$2:$AA$125,(X$4), FALSE)","v":0},{"$f":"VLOOKUP($B10,'Feed Ingredients'!$A$2:$AA$125,(Y$4), FALSE)","v":0},{"$f":"VLOOKUP($B10,'Feed Ingredients'!$A$2:$AA$125,(Z$4), FALSE)","v":0},{"$f":"VLOOKUP($B10,'Feed Ingredients'!$A$2:$AH$125,(AA$4), FALSE)","v":0},{"$f":"VLOOKUP($B10,'Feed Ingredients'!$A$2:$AH$125,(AB$4), FALSE)","v":0},{"$f":"VLOOKUP($B10,'Feed Ingredients'!$A$2:$AH$125,(AC$4), FALSE)","v":0},{"$f":"VLOOKUP($B10,'Feed Ingredients'!$A$2:$AH$125,(AD$4), FALSE)","v":0},{"$f":"VLOOKUP($B10,'Feed Ingredients'!$A$2:$AH$125,(AE$4), FALSE)","v":0},{"$f":"VLOOKUP($B10,'Feed Ingredients'!$A$2:$AH$125,(AF$4), FALSE)","v":0},{"$f":"VLOOKUP($B10,'Feed Ingredients'!$A$2:$AH$125,(AG$4), FALSE)","v":0},{"$f":"VLOOKUP($B10,'Feed Ingredients'!$A$2:$AH$125,(AH$4), FALSE)","v":0},null,{"$f":"VLOOKUP($B10,'Feed Ingredients'!$A$2:$AH$125,(AJ$4), FALSE)","v":10}]
{"$rows_left_out":27}
{"sheet":"Min_Max","index":7,"n_rows":15,"n_cols":19,"rows_kept":15,"cut":false,"hidden":false,"merged":[[4,1,4,2]]}
["Min / Max Calculations"]
[null,null,null,null,null,null,null,null,null,null,"From Print_Tag",null,null,"Min","Max",null,null,null,"Beef Feed"]
["CF & ADF (rabbit)",null,null,null,"Max > min by not>",null,5,"% units",null,null,10.15,{"$f":"ROUND(K3,1)","v":10.199999999999999},null,{"$f":"L3-2.5","v":7.6999999999999993},{"$f":"L3+2.5","v":12.7},null,null,null,"Dairy Feed"]
[null,null,null,null,null,null,null,null,null,null,null,null,null,null,null,null,null,null,"Equine Feed"]
["Ca, Salt, Na","Range",null,null,null,null,null,null,null,null,null,null,null,null,null,null,null,null,"Swine Feed"]
[null,"Min","Max",null,null,null,null,null,null,null,"From Print_Tag",null,null,"Min","Max","+ / -",null,null,"Poultry Feed"]
["<2.5",0,2.4990000000000001,null,"Max > min by not>",null,0.5,"% units",null,null,2.35,{"$f":"ROUND(K7,1)","v":2.4},null,{"$f":"L7-(P7)","v":2.15},{"$f":"L7+(P7)","v":2.65},0.25,null,null,"Goat Feed"]
["2.5 - 5",2.5,5,null,"Max > min by not>",null,1,"% units",null,null,5,{"$f":"ROUND(K8,1)","v":5},null,{"$f":"L8-(P8)","v":4.5},{"$f":"L8+(P8)","v":5.5},0.5,null,null,"Sheep Feed"]
["5+",5.01,27.5,null,"Max > min by not>",null,5,"% units",null,null,26,{"$f":"ROUND(K9,1)","v":26},null,25.91,26.09,0.09,"Conc *0.09",null,"Rabbit Feed"]
["5+",27.51,100,null,"Max > min by not>",null,20,"% of min",null,null,27.5,{"$f":"ROUND(K10,1)","v":27.5},null,25,30,2.5,null,null,"Fish Feed"]
{"$rows_left_out":6}
{"sheet":"Drug_Calc2","index":8,"n_rows":37,"n_cols":14,"rows_kept":37,"cut":false,"hidden":false,"merged":[]}
["Insp. No.",{"$f":"'Calculation Sheet'!B1","v":0},"Mnfr. No.",null,{"$f":"'Calculation Sheet'!D1","v":0}]
[null,null,"Mnfr. Name",null,{"$f":"'Calculation Sheet'!D2","v":0}]
["Formula Weight lb.",{"$f":"'Calculation Sheet'!A4","v":2000},"Product",null,{"$f":"'Calculation Sheet'!D3","v":0}]
[]
[]
["Medication","g/ton","g/lb","mg/lb","%"]
["Chlortetracycline ",{"$f":"'Calculation Sheet'!AB6","v":0},{"$f":"B7/2000","v":0},{"$f":"C7*1000","v":0},{"$f":"(B7/453.54)/2000","v":0},null,null,{"$f":"IF(B7>0,1,0)","v":0}]
["Sulfamethazine",{"$f":"'Calculation Sheet'!AC6","v":0},{"$f":"B8/2000","v":0},{"$f":"C8*1000","v":0},{"$f":"(B8/453.54)/2000","v":0},null,null,{"$f":"IF(B8>0,1,0)","v":0}]
["Monensin",{"$f":"'Calculation Sheet'!AD6","v":0},0,0,0,null,null,0]
["Lasalocid ",{"$f":"'Calculation Sheet'!AE6","v":0},0,0,0,null,null,0]
{"$rows_left_out":27}