{"text_format":"1","workbook":"xlsx","n_sheets":9,"sheets":["Instructions","INPUT","Print_Tag","Printout","Feed Ingredients","Old_to_New_Feed_Ingredient_Conv","Calculation Sheet","Min_Max","Drug_Calc2"],"not_rendered":{"charts":0,"images":0,"macros":0,"external_links":0,"defined_names":8,"comments":2,"pivot_tables":0},"unopened":[],"bounds":{"document_bytes":16777216,"sheet_cells":100000,"rows_first":2000,"rows_last":500,"rows_between":2000,"halvings":0,"cell_chars":16384,"cell_head_chars":4096},"cells_cut":0,"cells_raw":0,"read":"whole","date_system":"1900"}

{"sheet":"Instructions","index":0,"n_rows":33,"n_cols":5,"rows_kept":33,"cut":false,"hidden":false,"merged":[]}
["Basic instructions for use of the feed caclulation program"]
[]
["Adding new feedstuffs"]
[null,"New feed ingredients may be added to the Feed Ingredients sheet by inserting lines or replacing blank feeds."]
[null,"If you have ingredients in the pre-2018 version of the calculator that you wish to convert to the new format, copy"]
[null,"the ingredients into the Old_to_New_Feed_Ingredient_Calc sheet and paste the converted values into the"]
[null,"Feed Ingredients sheet (as values)."]
["Nutrient Values"]
[null,"Non-protein nitrogen (NPN) is entered as equivalent CP from NPN."]
[null,"Lysine can be estimated by using 4% of the crude protein value."]
[null,"Methionine can be estimated by using 1.5% of the crude protein value."]
[null,"Sodium can be estimated by using 40% of the salt value."]
[null,"Chloride can be estimated by using 60% of the salt value."]
[null,"For Ca and salt, use the guarantee midpoint and not the minimum guarantee."]
[null,"If a feed ingredient is not in the listing, a good reference is the current Feedstuffs reference guide."]
["Formulation"]
[null,"From the INPUT sheet, select ingredients by typing a number between 1 and 30 in column A."]
[null,"Enter amount in pounds of each ingredient in column F.  Total lbs will show in cell F36."]
[null,"For medicated feeds, enter feed rate (lb/hd/d) in cell I3."]
["Medicated Feeds"]
[null,"If an ingredient containing a medication is included in the formulation, g/ton of the medication will appear"]
[null,"on the Print-Out.  If a feed rate is entered, mg/hd/d of medication is also calculated."]
[null,"These medications are included in the program."]
[null,"Chlortetracycline ",null,null,"Alone and in combo with sulfamethazine or lasalocid"]
[null,"Sulfamethazine"]
[null,"Monensin"]
[null,"Lasalocid "]
[null,"Deccox"]
[null,"Bacitracin"]
[null,"Amprolium"]
["Print-Out "]
[null,"For customer-formula feeds, print only the Print-Out page and staple to the inspector card."]
[null,"Include all nutrient values for the appropriate species in the Inspector Entry Program."]

{"sheet":"INPUT","index":1,"n_rows":129,"n_cols":9,"rows_kept":129,"cut":false,"hidden":false,"merged":[]}
[null,"Insp #",null,null,null,{"$f":"TODAY()","v":"2022-06-14"},null,"Select feed type from menu"]
[null,"Manf name",null,null,"Big Blue Feed Mill",null,null,null,"Beef Feed"]
[null,"Product name",null,null,"Custom Beef Mix",{"$f":"Print_Tag!H3","v":" "},null,"Feed rate (lbs)",5]
[]
[null,null,null,null,"Ingredients Selected","Amount lbs"]
[null,{"$f":"'Feed Ingredients'!A2","v":"Alfalfa Meal"},null,1,{"$f":"IF(ISERROR(VLOOKUP(D6,A$6:B$129,2,0)),\"No feed\",(VLOOKUP(D6,A$6:B$129,2,0)))","v":"Corn (7% CP)"},725,null,"Crude Protein %",{"$f":"Printout!B6","v":15.842499999999999}]
[null,{"$f":"'Feed Ingredients'!A3","v":"Ammonium Chloride"},null,{"$f":"D6+1","v":2},"Corn Gluten Feed (18% CP)",300,null,"NPN %",{"$f":"Printout!B7","v":0}]
[null,{"$f":"'Feed Ingredients'!A4","v":"Bakery Byproduct"},null,{"$f":"D7+1","v":3},"Distillers DG w/sol Beverage",300,null,"Lysine %",{"$f":"Printout!B8","v":0.69450000000000001}]
[null,{"$f":"'Feed Ingredients'!A5","v":"Barley"},null,4,"Soy Hulls",400,null,"Methionine %",{"$f":"Printout!B9","v":0.39165}]
[null,{"$f":"'Feed Ingredients'!A6","v":"Beet Pulp"},null,5,"Soybean Meal 46.5",200,null,"Crude Fat %",{"$f":"Printout!B10","v":3.8497499999999998}]
[null,{"$f":"'Feed Ingredients'!A7","v":"Biuret"},null,6,"Cane Molasses (Dried)",30,null,"Crude Fiber %",{"$f":"Printout!B11","v":10.435}]
[7,{"$f":"'Feed Ingredients'!A8","v":"Calcium Carbonate"},null,7,"Calcium Carbonate",25,null,"ADF % ",{"$f":"Printout!B12","v":15.938750000000001}]
[null,{"$f":"'Feed Ingredients'!A9","v":"Cane Molasses"},null,8,"Salt (NaCl)",15,null,"NDF % ",{"$f":"Printout!B13","v":26.643750000000001}]
[6,{"$f":"'Feed Ingredients'!A10","v":"Cane Molasses (Dried)"},null,9,"TM Salt",5,null,"Calcium %",{"$f":"Printout!B14","v":0.66962500000000003}]
[null,{"$f":"'Feed Ingredients'!A11","v":"Canola Meal"},null,10,"No feed",null,null,"Phosphorus % ",{"$f":"Printout!B15","v":0.400225}]
[null,{"$f":"'Feed Ingredients'!A12","v":"Citrus Pulp"},null,11,"No feed",null,null,"Salt % ",{"$f":"Printout!B16","v":0.99124999999999996}]
[null,{"$f":"'Feed Ingredients'!A13","v":"Corn & Cob Meal"},null,12,"No feed",null,null,"Sodium % ",{"$f":"Printout!B17","v":0.43245775000000003}]
[null,{"$f":"'Feed Ingredients'!A14","v":"Corn (6.5% CP)"},null,13,"No feed",null,null,"Magnesium % ",{"$f":"Printout!B18","v":0.1525}]
[1,{"$f":"'Feed Ingredients'!A15","v":"Corn (7% CP)"},null,14,"No feed",null,null,"Potassium % ",{"$f":"Printout!B19","v":0.78349999999999997}]
[null,{"$f":"'Feed Ingredients'!A16","v":"Corn (7.5% CP)"},null,15,"No feed",null,null,"Sulfur % ",{"$f":"Printout!B20","v":0.13069999999999998}]
[null,{"$f":"'Feed Ingredients'!A17","v":"Corn Germ Meal (Cargill)"},null,16,"No feed",null,null,"Copper ppm",{"$f":"Printout!B21","v":11.5375}]
[null,{"$f":"'Feed Ingredients'!A18","v":"Corn Germ Meal (wet mill)"},null,17,"No feed",null,null,"Selenium ppm",{"$f":"Printout!B22","v":0}]
[null,{"$f":"'Feed Ingredients'!A19","v":"Corn Gluten Feed (16% CP)"},null,18,"No feed",null,null,"Zinc ppm",{"$f":"Printout!B23","v":48.457500000000003}]
[2,{"$f":"'Feed Ingredients'!A20","v":"Corn Gluten Feed (18% CP)"},null,19,"No feed",null,null,"Iron ppm",{"$f":"Printout!B24","v":172.16249999999999}]
[null,{"$f":"'Feed Ingredients'!A21","v":"Corn Gluten Feed (20% CP)"},null,20,"No feed",null,null,"Manganese ppm",{"$f":"Printout!B25","v":23.905000000000001}]
[null,{"$f":"'Feed Ingredients'!A22","v":"Corn Gluten Meal"},null,21,"No feed",null,null,"Cobalt ppm",{"$f":"Printout!B26","v":0.26424999999999998}]
[null,{"$f":"'Feed Ingredients'!A23","v":"Cottonseed Delinted"},null,22,"No feed",null,null,"Iodine ppm",{"$f":"Printout!B27","v":0}]
[null,{"$f":"'Feed Ingredients'!A24","v":"Cottonseed Hulls"},null,23,"No feed",null,null,"Vitamin A IU/lb",{"$f":"Printout!B28","v":0}]
[null,{"$f":"'Feed Ingredients'!A25","v":"Cottonseed Meal"},null,24,"No feed",null,null,"Vitamin D IU/lb",{"$f":"Printout!B29","v":0}]
[null,{"$f":"'Feed Ingredients'!A26","v":"Cottonseed, Whole"},null,25,"No feed",null,null,"Vitamin E IU/lb",{"$f":"Printout!B30","v":0}]
[null,{"$f":"'Feed Ingredients'!A27","v":"Dicalcium Phosphate"},null,26,"No feed"]
[3,{"$f":"'Feed Ingredients'!A28","v":"Distillers DG w/sol Beverage"},null,27,"No feed",null,null,"Moisture",{"$f":"'Calculation Sheet'!AJ6","v":10.547499999999999}]
[null,{"$f":"'Feed Ingredients'!A29","v":"Distillers DG w/sol Ethanol"},null,28,"No feed"]
[null,{"$f":"'Feed Ingredients'!A30","v":"Dried Whey"},null,29,"No feed"]
[null,{"$f":"'Feed Ingredients'!A31","v":"DYNA-K KCl"},null,30,"No feed"]
[null,{"$f":"'Feed Ingredients'!A32","v":"EDDI 9.2% Premix"},null,null,null,{"$f":"SUM(F6:F35)","v":2000}]
[null,{"$f":"'Feed Ingredients'!A33","v":"Fish Meal Menhaden"}]
[null,{"$f":"'Feed Ingredients'!A34","v":"Hominy Feed"},null,null,null,"Percent of mix"]
[null,{"$f":"'Feed Ingredients'!A35","v":"Lysine HCl"},null,null,{"$f":"E6","v":"Corn (7% CP)"},{"$f":"F6/F$36","v":0.36249999999999999}]
[null,{"$f":"'Feed Ingredients'!A36","v":"Magnesium Oxide 54"},null,null,{"$f":"E7","v":"Corn Gluten Feed (18% CP)"},{"$f":"F7/F$36","v":0.15}]
[null,{"$f":"'Feed Ingredients'!A37","v":"Mag Pot Sulfate"},null,null,"Distillers DG w/sol Beverage",0.15]
[null,{"$f":"'Feed Ingredients'!A38","v":"Meat & Bone Meal"},null,null,"Soy Hulls",0.2]
[null,{"$f":"'Feed Ingredients'!A39","v":"Millet"},null,null,"Soybean Meal 46.5",0.1]
[null,{"$f":"'Feed Ingredients'!A40","v":"Mineral-Vitamin Premix"},null,null,"Cane Molasses (Dried)",1.4999999999999999E-2]
[null,{"$f":"'Feed Ingredients'!A41","v":"Mono-dical Phosphate"},null,null,"Calcium Carbonate",1.2500000000000001E-2]
[null,{"$f":"'Feed Ingredients'!A42","v":"Oat Meal Byproduct"},null,null,"Salt (NaCl)",7.4999999999999997E-3]
[null,{"$f":"'Feed Ingredients'!A43","v":"Oats"},null,null,"TM Salt",2.5000000000000001E-3]
[null,{"$f":"'Feed Ingredients'!A44","v":"Rice Bran"},null,null,"No feed",0]
[null,{"$f":"'Feed Ingredients'!A45","v":"Rice Hulls"},null,null,"No feed",0]
[null,{"$f":"'Feed Ingredients'!A46","v":"Safflower Seed Meal"},null,null,"No feed",0]
[8,{"$f":"'Feed Ingredients'!A47","v":"Salt (NaCl)"},null,null,"No feed",0]
[null,{"$f":"'Feed Ingredients'!A48","v":"Selenium Premix 600"},null,null,"No feed",0]
[null,{"$f":"'Feed Ingredients'!A49","v":"Sodium Bentonite"},null,null,"No feed",0]
[null,{"$f":"'Feed Ingredients'!A50","v":"Sodium Bicarbonate"}]
[null,{"$f":"'Feed Ingredients'!A51","v":"Sorghum/Milo"}]
[4,{"$f":"'Feed Ingredients'!A52","v":"Soy Hulls"}]
[null,{"$f":"'Feed Ingredients'!A53","v":"Soybean Meal 44"}]
[5,{"$f":"'Feed Ingredients'!A54","v":"Soybean Meal 46.5"}]
[null,{"$f":"'Feed Ingredients'!A55","v":"Soybean Meal 47.5"}]
[null,{"$f":"'Feed Ingredients'!A56","v":"Sunflower (Black)"}]
[null,{"$f":"'Feed Ingredients'!A57","v":"Sunflower (Stripe)"}]
[null,{"$f":"'Feed Ingredients'!A58","v":"Sunflower Meal Solvent"}]
[null,{"$f":"'Feed Ingredients'!A59","v":"TNT Swine PMX 75"}]
[null,{"$f":"'Feed Ingredients'!A60","v":"TNT Swine PMX 75(E)"}]
[null,{"$f":"'Feed Ingredients'!A61","v":"Urea 46%"}]
[null,{"$f":"'Feed Ingredients'!A62","v":"Vegetable Oil"}]
[null,{"$f":"'Feed Ingredients'!A63","v":"Vitamin A 650 Premix"}]
[null,{"$f":"'Feed Ingredients'!A64","v":"Vitamin ADE Premix"}]
[null,{"$f":"'Feed Ingredients'!A65","v":"Wheat"}]
[null,{"$f":"'Feed Ingredients'!A66","v":"Wheat Bran"}]
[null,{"$f":"'Feed Ingredients'!A67","v":"Wheat Midds"}]
[null,{"$f":"'Feed Ingredients'!A68","v":"Wheat Screenings"}]
[null,{"$f":"'Feed Ingredients'!A69","v":"Yeast"}]
[9,{"$f":"'Feed Ingredients'!A70","v":"TM Salt"}]
[null,{"$f":"'Feed Ingredients'!A71","v":"Flaxseed"}]
[null,{"$f":"'Feed Ingredients'!A72","v":"Soybeans Roasted"}]
[null,{"$f":"'Feed Ingredients'!A73","v":"Peanut Pieces"}]
[null,{"$f":"'Feed Ingredients'!A74","v":"Apple, whole"}]
[null,{"$f":"'Feed Ingredients'!A75","v":"Carrots"}]
[null,{"$f":"'Feed Ingredients'!A76","v":"Oyster Shell"}]
[null,{"$f":"'Feed Ingredients'!A77","v":"Sugar"}]
[null,{"$f":"'Feed Ingredients'!A78","v":"Distillers DG w/sol TCF"}]
[null,{"$f":"'Feed Ingredients'!A79","v":"Oats PP"}]
[null,{"$f":"'Feed Ingredients'!A80","v":"Rice Bran MaxEGlo"}]
[null,{"$f":"'Feed Ingredients'!A81","v":"Soybean Meal 47.5 SS"}]
[null,{"$f":"'Feed Ingredients'!A82","v":"Sunflower (Black) TG"}]
[null,{"$f":"'Feed Ingredients'!A83","v":"Acorns"}]
[null,{"$f":"'Feed Ingredients'!A84","v":"Potassium magnesium sulfate"}]
[null,{"$f":"'Feed Ingredients'!A85","v":"zBlank10"}]
[null,{"$f":"'Feed Ingredients'!A86","v":"zBlank11"}]
[null,{"$f":"'Feed Ingredients'!A87","v":"zBlank12"}]
[null,{"$f":"'Feed Ingredients'!A88","v":"zBlank13"}]
[null,{"$f":"'Feed Ingredients'!A89","v":"zBlank14"}]
[null,{"$f":"'Feed Ingredients'!A90","v":"zBlank15"}]
[null,{"$f":"'Feed Ingredients'!A91","v":"…..COMMERCIAL FEEDS….."}]
[null,{"$f":"'Feed Ingredients'!A92","v":"zBlank16"}]
[null,{"$f":"'Feed Ingredients'!A93","v":"zBlank17"}]
[null,{"$f":"'Feed Ingredients'!A94","v":"zBlank18"}]
[null,{"$f":"'Feed Ingredients'!A95","v":"zBlank19"}]
[null,{"$f":"'Feed Ingredients'!A96","v":"zBlank20"}]
[null,{"$f":"'Feed Ingredients'!A97","v":"zBlank21"}]
[null,{"$f":"'Feed Ingredients'!A98","v":"zBlank22"}]
[null,{"$f":"'Feed Ingredients'!A99","v":"zBlank23"}]
[null,{"$f":"'Feed Ingredients'!A100","v":"zBlank24"}]
[null,{"$f":"'Feed Ingredients'!A101","v":"zBlank25"}]
[null,{"$f":"'Feed Ingredients'!A102","v":"zBlank26"}]
[null,{"$f":"'Feed Ingredients'!A103","v":"zBlank27"}]
[null,{"$f":"'Feed Ingredients'!A104","v":"zBlank28"}]
[null,{"$f":"'Feed Ingredients'!A105","v":"zBlank29"}]
[null,{"$f":"'Feed Ingredients'!A106","v":"zBlank30"}]
[null,{"$f":"'Feed Ingredients'!A107","v":"..MEDICATIONS TYPE B/C.."}]
[null,{"$f":"'Feed Ingredients'!A108","v":"CTC 2 g/lb"}]
[null,{"$f":"'Feed Ingredients'!A109","v":"CTC 4 g/lb"}]
[null,{"$f":"'Feed Ingredients'!A110","v":"CTC 10 g/lb"}]
[null,{"$f":"'Feed Ingredients'!A111","v":"AS 70"}]
[null,{"$f":"'Feed Ingredients'!A112","v":"BMD Type B"}]
[null,{"$f":"'Feed Ingredients'!A113","v":"Rumensin 90 (Type A)"}]
[null,{"$f":"'Feed Ingredients'!A114","v":"Bovatec 91 (Type A)"}]
[null,{"$f":"'Feed Ingredients'!A115","v":"Amprolium 2.5%"}]
[null,{"$f":"'Feed Ingredients'!A116","v":"Rumensin (Type B)"}]
[null,{"$f":"'Feed Ingredients'!A117","v":"Bovatec (Type B)"}]
[null,{"$f":"'Feed Ingredients'!A118","v":"zBlank31"}]
[null,{"$f":"'Feed Ingredients'!A119","v":"zBlank32"}]
[null,{"$f":"'Feed Ingredients'!A120","v":"zBlank33"}]
[null,{"$f":"'Feed Ingredients'!A121","v":"zBlank34"}]
[null,{"$f":"'Feed Ingredients'!A122","v":"zBlank35"}]
[null,{"$f":"'Feed Ingredients'!A123","v":"zBlank36"}]
[null,{"$f":"'Feed Ingredients'!A124","v":"zBlank37"}]
[null,{"$f":"'Feed Ingredients'!A125","v":"No feed"}]

{"sheet":"Print_Tag","index":2,"n_rows":37,"n_cols":11,"rows_kept":37,"cut":false,"hidden":false,"merged":[[3,2,4,2],[3,1,4,1],[3,4,4,4],[3,13,4,13]]}
["Insp. No.:",null,{"$f":"INPUT!E1","v":0}]
["Manuf. Name:",null,{"$f":"INPUT!E2","v":"Big Blue Feed Mill"},null,null,null,null,{"$f":"INPUT!E3","v":"Custom Beef Mix"}]
["Total Pounds",null,{"$f":"'Calculation Sheet'!A4","v":2000},null,null,null,null,{"$f":"IF(B32=\"Yes\",\"Medicated\",\" \")","v":" "}]
[null,"All Calculated Nutrients",{"$f":"INPUT!I2","v":"Beef Feed"},null,{"$f":"C4","v":"Beef Feed"},"Tag"]
["GUARANTEES",null,null,null,null,"Guarantees","Adjust"]
["Crude Protein %",{"$f":"Printout!B6","v":15.842499999999999},{"$f":"IF(E6>0,E6,\" \")","v":15.842499999999999},null,{"$f":"HLOOKUP(C$4,Printout!$C$4:$O$30,3,0)","v":15.842499999999999},{"$f":"IF(E6>0,A6,\" \")","v":"Crude Protein %"},-0.1,{"$f":"IF(F6=A6,(ROUND((C6+G6),1)),\" \")","v":15.7},{"$f":"IF(F6=A6,\"Min\",\" \")","v":"Min"}]
["NPN %",{"$f":"Printout!B7","v":0},{"$f":"IF(E7>0,E7,\" \")","v":" "},null,{"$f":"HLOOKUP(C$4,Printout!$C$4:$O$30,4,0)","v":0},{"$f":"IF(E7>0,A7,\" \")","v":" "},0.2,{"$f":"IF(F7=A7,(ROUND((C7+G7),1)),\" \")","v":" "},{"$f":"IF(F7=A7,\"Max\",\" \")","v":" "}]
["Lysine %",{"$f":"Printout!B8","v":0.69450000000000001}," ",null,{"$f":"HLOOKUP(C$4,Printout!$C$4:$O$30,5,0)","v":0}," ",0,{"$f":"IF(F8=A8,(ROUND((C8+G8),1)),\" \")","v":" "}," "]
["Methionine %",{"$f":"Printout!B9","v":0.39165}," ",null,{"$f":"HLOOKUP(C$4,Printout!$C$4:$O$30,6,0)","v":0}," ",0,{"$f":"IF(F9=A9,(ROUND((C9+G9),1)),\" \")","v":" "}," "]
["Crude Fat %",{"$f":"Printout!B10","v":3.8497499999999998},3.8497499999999998,null,{"$f":"HLOOKUP(C$4,Printout!$C$4:$O$30,7,0)","v":3.8497499999999998},"Crude Fat %",-0.1,{"$f":"IF(F10=A10,(ROUND((C10+G10),1)),\" \")","v":3.7},"Min"]
["Crude Fiber %",{"$f":"Printout!B11","v":10.435},10.435,null,{"$f":"HLOOKUP(C$4,Printout!$C$4:$O$30,8,0)","v":10.435},"Crude Fiber %",0.5,10.9,{"$f":"IF(F11=A11,\"Max\",\" \")","v":"Max"}]
["ADF % ",{"$f":"Printout!B12","v":15.938750000000001}," ",null,{"$f":"HLOOKUP(C$4,Printout!$C$4:$O$30,9,0)","v":0}," ",0.5," "," "]
["NDF % ",{"$f":"Printout!B13","v":26.643750000000001}," ",null,{"$f":"HLOOKUP(C$4,Printout!$C$4:$O$30,10,0)","v":0}," ",0.5," "," "]
["Calcium %",{"$f":"Printout!B14","v":0.66962500000000003},0.66962500000000003,null,{"$f":"HLOOKUP(C$4,Printout!$C$4:$O$30,11,0)","v":0.66962500000000003},"Calcium %",null,{"$f":"IF(F14=A14,Min_Max!G13,\" \")","v":0.44999999999999996},{"$f":"IF(F14=A14,\"Min\",\" \")","v":"Min"},{"$f":"IF(F14=A14,Min_Max!H13,\" \")","v":0.95},{"$f":"IF(F14=A14,\"Max\",\" \")","v":"Max"}]
["Phosphorus % ",{"$f":"Printout!B15","v":0.400225},0.400225,null,{"$f":"HLOOKUP(C$4,Printout!$C$4:$O$30,12,0)","v":0.400225},"Phosphorus % ",-0.1,{"$f":"IF(F15=A15,(ROUND((C15+G15),1)),\" \")","v":0.3},{"$f":"IF(F15=A15,\"Min\",\" \")","v":"Min"}]
["Salt % ",{"$f":"Printout!B16","v":0.99124999999999996},0.99124999999999996,null,{"$f":"HLOOKUP(C$4,Printout!$C$4:$O$30,13,0)","v":0.99124999999999996},"Salt % ",null,{"$f":"IF(F16=A16,Min_Max!G14,\" \")","v":0.74124999999999996},"Min",{"$f":"IF(F16=A16,Min_Max!H14,\" \")","v":1.24125},{"$f":"IF(F16=A16,\"Max\",\" \")","v":"Max"}]
["Sodium % ",{"$f":"Printout!B17","v":0.43245775000000003}," ",null,{"$f":"HLOOKUP(C$4,Printout!$C$4:$O$30,14,0)","v":0},{"$f":"IF(E17>0,A17,\" \")","v":" "},null,{"$f":"IF(F17=A17,Min_Max!G15,\" \")","v":" "},{"$f":"IF(F17=A17,\"Min\",\" \")","v":" "},{"$f":"IF(F17=A17,Min_Max!H15,\" \")","v":" "},{"$f":"IF(F17=A17,\"Max\",\" \")","v":" "}]
["Magnesium % ",{"$f":"Printout!B18","v":0.1525}," ",null,{"$f":"HLOOKUP(C$4,Printout!$C$4:$O$30,15,0)","v":0},{"$f":"A18","v":"Magnesium % "},-0.1,{"$f":"B18","v":0.1525},"Min"]
["Potassium % ",{"$f":"Printout!B19","v":0.78349999999999997},0.78349999999999997,null,{"$f":"HLOOKUP(C$4,Printout!$C$4:$O$30,16,0)","v":0.78349999999999997},"Potassium % ",null,{"$f":"IF(F19=A19,(ROUND((C19+G19),1)),\" \")","v":0.8},"Min"]
["Sulfur % ",{"$f":"Printout!B20","v":0.13069999999999998}," ",null,{"$f":"HLOOKUP(C$4,Printout!$C$4:$O$30,17,0)","v":0}," ",null," "," "]
["Copper ppm",{"$f":"Printout!B21","v":11.5375},11.5375,null,{"$f":"HLOOKUP(C$4,Printout!$C$4:$O$30,18,0)","v":11.5375},{"$f":"A21","v":"Copper ppm"},-0.1,{"$f":"B21","v":11.5375},{"$f":"IF(F21=A21,\"Min\",\" \")","v":"Min"}]
["Selenium ppm",{"$f":"Printout!B22","v":0}," ",null,{"$f":"HLOOKUP(C$4,Printout!$C$4:$O$30,19,0)","v":0},{"$f":"A22","v":"Selenium ppm"},-0.1,{"$f":"B22","v":0},"Min"]
["Zinc ppm",{"$f":"Printout!B23","v":48.457500000000003},48.457500000000003,null,{"$f":"HLOOKUP(C$4,Printout!$C$4:$O$30,20,0)","v":48.457500000000003},{"$f":"A23","v":"Zinc ppm"},-0.1,{"$f":"B23","v":48.457500000000003},{"$f":"IF(F23=A23,\"Min\",\" \")","v":"Min"}]
["Iron ppm",{"$f":"Printout!B24","v":172.16249999999999}," ",null,{"$f":"HLOOKUP(C$4,Printout!$C$4:$O$30,21,0)","v":0}," ",null," "," "]
["Manganese ppm",{"$f":"Printout!B25","v":23.905000000000001}," ",null,{"$f":"HLOOKUP(C$4,Printout!$C$4:$O$30,22,0)","v":0}," ",null," "," "]
["Cobalt ppm",{"$f":"Printout!B26","v":0.26424999999999998}," ",null,{"$f":"HLOOKUP(C$4,Printout!$C$4:$O$30,23,0)","v":0}," ",null," "," "]
["Iodine ppm",{"$f":"Printout!B27","v":0}," ",null,{"$f":"HLOOKUP(C$4,Printout!$C$4:$O$30,24,0)","v":0}," ",null," "," "]
["Vitamin A IU/lb",{"$f":"Printout!B28","v":0}," ",null,{"$f":"HLOOKUP(C$4,Printout!$C$4:$O$30,25,0)","v":0}," ",null," "," "]
["Vitamin D IU/lb",{"$f":"Printout!B29","v":0}," ",null,{"$f":"HLOOKUP(C$4,Printout!$C$4:$O$30,26,0)","v":0}," ",null," "," "]
["Vitamin E IU/lb",{"$f":"Printout!B30","v":0}," ",null,{"$f":"HLOOKUP(C$4,Printout!$C$4:$O$30,27,0)","v":0}," ",null," "," "]
[]
[{"$f":"Printout!A31","v":"Medicated feed ?"},{"$f":"Printout!B31","v":"No"}]
[{"$f":"Drug_Calc2!F24","v":"None"},{"$f":"Drug_Calc2!G24","v":" "}]
[{"$f":"Drug_Calc2!F25","v":" "},{"$f":"Drug_Calc2!G25","v":" "}]
[{"$f":"Printout!A34","v":" "},{"$f":"Printout!B34","v":5}]
[{"$f":"Drug_Calc2!H24","v":" "},{"$f":"Drug_Calc2!I24","v":" "}]
[{"$f":"Drug_Calc2!H25","v":" "},{"$f":"Drug_Calc2!I25","v":" "}]

{"sheet":"Printout","index":3,"n_rows":48,"n_cols":15,"rows_kept":48,"cut":false,"hidden":false,"merged":[[3,2,4,2],[3,3,4,3],[3,4,4,4],[3,5,4,5],[3,11,4,11],[3,12,4,12],[3,13,4,13],[3,14,4,14],[3,6,4,6],[3,7,4,7],[3,8,4,8],[3,9,4,9],[3,10,4,10]]}
["Insp. No.:",{"$f":"Print_Tag!C1","v":0},null,"Product:",{"$f":"Print_Tag!H2","v":"Custom Beef Mix"}]
["Manuf. Name:",{"$f":"Print_Tag!C2","v":"Big Blue Feed Mill"}]
["Total Pounds",{"$f":"'Calculation Sheet'!A4","v":2000},null,null,null,"Complete Feeds and Supplements"]
[null,null,"Beef Feed","Dairy Feed","Equine Feed","Swine Feed","Poultry Feed","Goat Feed","Sheep Feed","Rabbit Feed","Fish Feed","Deer Feed","Deer Mineral","Mineral Feed","Milk Replacer"]
["GUARANTEES","MIX"]
["Crude Protein %",{"$f":"'Calculation Sheet'!C6","v":15.842499999999999},{"$f":"$B$6","v":15.842499999999999},{"$f":"$B$6","v":15.842499999999999},15.842499999999999,15.842499999999999,15.842499999999999,15.842499999999999,15.842499999999999,15.842499999999999,15.842499999999999,15.842499999999999,null,null,15.842499999999999]
["NPN %",{"$f":"'Calculation Sheet'!D6","v":0},{"$f":"$B$7","v":0},{"$f":"$B$7","v":0},null,null,null,{"$f":"$B$7","v":0},{"$f":"$B$7","v":0}]
["Lysine %",{"$f":"'Calculation Sheet'!E6","v":0.69450000000000001},null,null,null,{"$f":"$B$8","v":0.69450000000000001},{"$f":"$B$8","v":0.69450000000000001}]
["Methionine %",{"$f":"'Calculation Sheet'!F6","v":0.39165},null,null,null,null,{"$f":"$B$9","v":0.39165}]
["Crude Fat %",{"$f":"'Calculation Sheet'!G6","v":3.8497499999999998},{"$f":"$B$10","v":3.8497499999999998},{"$f":"$B$10","v":3.8497499999999998},3.8497499999999998,3.8497499999999998,3.8497499999999998,3.8497499999999998,3.8497499999999998,3.8497499999999998,3.8497499999999998,3.8497499999999998,null,null,3.8497499999999998]
["Crude Fiber %",{"$f":"'Calculation Sheet'!H6","v":10.435},{"$f":"$B$11","v":10.435},{"$f":"$B$11","v":10.435},10.435,10.435,10.435,10.435,10.435,10.435,10.435,10.435,null,null,10.435]
["ADF % ",{"$f":"'Calculation Sheet'!I6","v":15.938750000000001},null,{"$f":"$B$12","v":15.938750000000001},{"$f":"$B$12","v":15.938750000000001},null,null,{"$f":"$B$12","v":15.938750000000001}]
["NDF % ",{"$f":"'Calculation Sheet'!J6","v":26.643750000000001},null,null,{"$f":"$B$13","v":26.643750000000001}]
["Calcium %",{"$f":"'Calculation Sheet'!K6","v":0.66962500000000003},{"$f":"$B$14","v":0.66962500000000003},{"$f":"$B$14","v":0.66962500000000003},0.66962500000000003,0.66962500000000003,0.66962500000000003,0.66962500000000003,0.66962500000000003,0.66962500000000003,null,0.66962500000000003,0.66962500000000003,0.66962500000000003,0.66962500000000003]
["Phosphorus % ",{"$f":"'Calculation Sheet'!L6","v":0.400225},{"$f":"$B$15","v":0.400225},{"$f":"$B$15","v":0.400225},0.400225,0.400225,0.400225,0.400225,0.400225,0.400225,0.400225,0.400225,0.400225,0.400225,0.400225]
["Salt % ",{"$f":"'Calculation Sheet'!M6","v":0.99124999999999996},{"$f":"$B$16","v":0.99124999999999996},null,null,{"$f":"$B$16","v":0.99124999999999996},{"$f":"$B$16","v":0.99124999999999996},{"$f":"$B$16","v":0.99124999999999996},{"$f":"$B$16","v":0.99124999999999996},{"$f":"$B$16","v":0.99124999999999996},null,{"$f":"$B$16","v":0.99124999999999996},{"$f":"$B$16","v":0.99124999999999996},0.99124999999999996]
["Sodium % ",{"$f":"'Calculation Sheet'!N6","v":0.43245775000000003}]
["Magnesium % ",{"$f":"'Calculation Sheet'!O6","v":0.1525}]
["Potassium % ",{"$f":"'Calculation Sheet'!P6","v":0.78349999999999997},{"$f":"$B$19","v":0.78349999999999997},{"$f":"$B$19","v":0.78349999999999997},0.78349999999999997,0.78349999999999997,0.78349999999999997,0.78349999999999997,0.78349999999999997,0.78349999999999997,0.78349999999999997,null,null,null,0.78349999999999997]
["Sulfur % ",{"$f":"'Calculation Sheet'!Q6","v":0.13069999999999998}]
["Copper ppm",{"$f":"'Calculation Sheet'!R6","v":11.5375},{"$f":"$B$21","v":11.5375},11.5375,11.5375,11.5375,11.5375,11.5375,11.5375,11.5375,11.5375,null,11.5375,11.5375,11.5375]
["Selenium ppm",{"$f":"'Calculation Sheet'!S6","v":0},{"$f":"$B$22","v":0},{"$f":"$B$22","v":0},0,0,0,0,0,0,0,null,0,0,0]
["Zinc ppm",{"$f":"'Calculation Sheet'!T6","v":48.457500000000003},{"$f":"$B$23","v":48.457500000000003},{"$f":"$B$23","v":48.457500000000003},48.457500000000003,48.457500000000003,48.457500000000003,48.457500000000003,48.457500000000003,48.457500000000003,48.457500000000003,null,48.457500000000003,48.457500000000003,48.457500000000003]
["Iron ppm",{"$f":"'Calculation Sheet'!U6","v":172.16249999999999}]
["Manganese ppm",{"$f":"'Calculation Sheet'!V6","v":23.905000000000001}]
["Cobalt ppm",{"$f":"'Calculation Sheet'!W6","v":0.26424999999999998}]
["Iodine ppm",{"$f":"'Calculation Sheet'!X6","v":0}]
["Vitamin A IU/lb",{"$f":"'Calculation Sheet'!Y6","v":0},{"$f":"$B$28","v":0},{"$f":"$B$28","v":0},{"$f":"$B$28","v":0},null,null,{"$f":"$B$28","v":0},{"$f":"$B$28","v":0},{"$f":"$B$28","v":0},null,null,null,null,{"$f":"$B$28","v":0}]
["Vitamin D IU/lb",{"$f":"'Calculation Sheet'!Z6","v":0}]
["Vitamin E IU/lb",{"$f":"'Calculation Sheet'!AA6","v":0}]
["Medicated feed ?",{"$f":"IF(SUM(Drug_Calc2!B7:B13)=0,\"No\",\"Yes\")","v":"No"}]
[{"$f":"Drug_Calc2!F24","v":"None"},{"$f":"Drug_Calc2!G24","v":" "},null,"Guarantees in bold are required on the label for that species.  Trace minerals & vitamin A, when added."]
[{"$f":"Drug_Calc2!F25","v":" "},{"$f":"Drug_Calc2!G25","v":" "},null,"Guarantees not in bold and shaded are optional guarantees that may be included on label."]
[{"$f":"IF($B31=\"Yes\",Drug_Calc2!D15,\" \")","v":" "},{"$f":"INPUT!I3","v":5},null,"Copper guarantee for goat and sheep feeds is required when > 20 ppm."]
[{"$f":"Drug_Calc2!H24","v":" "},{"$f":"Drug_Calc2!I24","v":" "},null,"Added minerals need to be guaranteed in beef, dairy & equine mineral feeds (exceptions Mg & K in equine)."]
[{"$f":"Drug_Calc2!H25","v":" "},{"$f":"Drug_Calc2!I25","v":" "},null,"A minimum crude fiber guarantee is needed on rabbit feeds, not to be less than 5% of the max."]
[]
["Ingredient",null,"Batch Wt",null,"Ingredient",null,"Batch Wt",null,null,"Ingredient",null,null,null,null,"Batch Wt"]
[{"$f":"'Calculation Sheet'!B7","v":"Corn (7% CP)"},null,{"$f":"'Calculation Sheet'!A7","v":725},null,{"$f":"'Calculation Sheet'!B17","v":"No feed"},null,{"$f":"'Calculation Sheet'!A17","v":0},null,null,{"$f":"'Calculation Sheet'!B27","v":"No feed"},null,null,null,null,{"$f":"'Calculation Sheet'!A27","v":0}]
[{"$f":"'Calculation Sheet'!B8","v":"Corn Gluten Feed (18% CP)"},null,{"$f":"'Calculation Sheet'!A8","v":300},null,{"$f":"'Calculation Sheet'!B18","v":"No feed"},null,{"$f":"'Calculation Sheet'!A18","v":0},null,null,{"$f":"'Calculation Sheet'!B28","v":"No feed"},null,null,null,null,{"$f":"'Calculation Sheet'!A28","v":0}]
[{"$f":"'Calculation Sheet'!B9","v":"Distillers DG w/sol Beverage"},null,{"$f":"'Calculation Sheet'!A9","v":300},null,{"$f":"'Calculation Sheet'!B19","v":"No feed"},null,{"$f":"'Calculation Sheet'!A19","v":0},null,null,{"$f":"'Calculation Sheet'!B29","v":"No feed"},null,null,null,null,{"$f":"'Calculation Sheet'!A29","v":0}]
[{"$f":"'Calculation Sheet'!B10","v":"Soy Hulls"},null,{"$f":"'Calculation Sheet'!A10","v":400},null,{"$f":"'Calculation Sheet'!B20","v":"No feed"},null,{"$f":"'Calculation Sheet'!A20","v":0},null,null,{"$f":"'Calculation Sheet'!B30","v":"No feed"},null,null,null,null,{"$f":"'Calculation Sheet'!A30","v":0}]
[{"$f":"'Calculation Sheet'!B11","v":"Soybean Meal 46.5"},null,{"$f":"'Calculation Sheet'!A11","v":200},null,{"$f":"'Calculation Sheet'!B21","v":"No feed"},null,{"$f":"'Calculation Sheet'!A21","v":0},null,null,{"$f":"'Calculation Sheet'!B31","v":"No feed"},null,null,null,null,{"$f":"'Calculation Sheet'!A31","v":0}]
[{"$f":"'Calculation Sheet'!B12","v":"Cane Molasses (Dried)"},null,{"$f":"'Calculation Sheet'!A12","v":30},null,{"$f":"'Calculation Sheet'!B22","v":"No feed"},null,{"$f":"'Calculation Sheet'!A22","v":0},null,null,{"$f":"'Calculation Sheet'!B32","v":"No feed"},null,null,null,null,{"$f":"'Calculation Sheet'!A32","v":0}]
[{"$f":"'Calculation Sheet'!B13","v":"Calcium Carbonate"},null,{"$f":"'Calculation Sheet'!A13","v":25},null,{"$f":"'Calculation Sheet'!B23","v":"No feed"},null,{"$f":"'Calculation Sheet'!A23","v":0},null,null,{"$f":"'Calculation Sheet'!B33","v":"No feed"},null,null,null,null,{"$f":"'Calculation Sheet'!A33","v":0}]
[{"$f":"'Calculation Sheet'!B14","v":"Salt (NaCl)"},null,{"$f":"'Calculation Sheet'!A14","v":15},null,{"$f":"'Calculation Sheet'!B24","v":"No feed"},null,{"$f":"'Calculation Sheet'!A24","v":0},null,null,{"$f":"'Calculation Sheet'!B34","v":"No feed"},null,null,null,null,{"$f":"'Calculation Sheet'!A34","v":0}]
[{"$f":"'Calculation Sheet'!B15","v":"TM Salt"},null,{"$f":"'Calculation Sheet'!A15","v":5},null,{"$f":"'Calculation Sheet'!B25","v":"No feed"},null,{"$f":"'Calculation Sheet'!A25","v":0},null,null,{"$f":"'Calculation Sheet'!B35","v":"No feed"},null,null,null,null,{"$f":"'Calculation Sheet'!A35","v":0}]
[{"$f":"'Calculation Sheet'!B16","v":"No feed"},null,{"$f":"'Calculation Sheet'!A16","v":0},null,{"$f":"'Calculation Sheet'!B26","v":"No feed"},null,{"$f":"'Calculation Sheet'!A26","v":0},null,null,{"$f":"'Calculation Sheet'!B36","v":"No feed"},null,null,null,null,{"$f":"'Calculation Sheet'!A36","v":0}]

{"sheet":"Feed Ingredients","index":4,"n_rows":125,"n_cols":34,"rows_kept":125,"cut":false,"hidden":false,"merged":[]}
[null,"Crude protein %","NPN %","Lysine %","Methionine %","CrudeFat %","Crude Fiber %","ADF %","NDF %","Ca %","P %","Salt %","Na %","Mg %","K %","S %","Cu ppm","Se ppm","Zn ppm","Fe ppm","Mn ppm","Co ppm","I ppm","Vit A IU/lb","Vit D IU/lb","Vit E IU/lb","Moisture %","CTC g/ton","Sulfamethazine g/ton","Monensin g/ton","Lasalocid g/ton","Deccox g/ton","Bacitracin g/ton","Amprolium g/ton"]
["Alfalfa Meal",17,null,0.73,0.28000000000000003,2.75,25,35,45,1.3,0.23,null,0.08,0.28999999999999998,2.2999999999999998,0.2,10,null,21,400,35,null,null,null,null,null,10]
["Ammonium Chloride",160,160,0,0,0,0,0,0,0,0,null,null,0,0,null,0,0,0,null,null,null,null,0,0,0]
["Bakery Byproduct",12,null,0.3,0.16,9,2.5,7,12,0.1,0.25,null,1.1000000000000001,0.3,0.1,0.02,5,null,15,50,60,0.5,null,null,null,null,8]
["Barley",10.5,null,0.4,0.12,1.8,4,6,17,7.0000000000000007E-2,0.36,null,0.03,0.13,0.44,0.15,8,null,20,80,16,0.1,null,null,null,null,10]
["Beet Pulp",8,null,0.6,0.01,0.5,21,24,38,0.6,0.1,null,0.19,0.27,0.21,0.2,13,null,1,300,35,0.8,null,null,null,null,9]
["Biuret",218,218,null,null,null,null,null,null,null,null,null,null,null,null,null,null,null,null,null,null,null,null,null,null,null,5]
["Calcium Carbonate",null,null,null,null,null,null,null,null,38,null,null,null,null,null,null,null,null,null,null,null,null,null,null,null,null,5]
["Cane Molasses",3,null,0.3,0.01,0.02,0.5,0.4,0.7,0.82,0.08,null,0.16,0.36,2.38,0.47,59,null,21,200,42,null,null,null,null,null,26]
["Cane Molasses (Dried)",7,null,0.3,0.01,0.4,6,8,10,1.1000000000000001,0.14000000000000001,null,0.2,0.4,3.4,0.57999999999999996,70,null,28,250,52,null,null,null,null,null,9]
["Canola Meal",35.5,null,2,0.75,7.5,12.5,19.600000000000001,27.8,0.7,1.2,null,null,0.6,1.3,1,8,null,65,175,54,0.3,null,null,null,null,7]
["Citrus Pulp",6,null,0.24,0.09,3,25,35,45,1.75,0.1,null,0.01,0.1,0.8,0,5,null,10,40,10,0.1,null,null,null,null,7]
["Corn & Cob Meal",6,null,0.2,0.16,3,8.6,11,21,0.04,0.2,null,null,0.13,0.42,0.1,6,null,12,130,10,0.7,null,null,null,null,12]
["Corn (6.5% CP)",6.5,null,0.24,0.2,3.5,2,3.5,9.5,0.01,0.25,null,null,0.08,0.32,0.08,3,null,19,37,6,0.1,null,null,null,null,12]
["Corn (7% CP)",7,null,0.24,0.2,3.5,2,3.5,9.5,0.01,0.25,null,null,0.08,0.32,0.08,3,null,19,37,6,0.1,null,null,null,null,12]
["Corn (7.5% CP)",7.5,null,0.24,0.2,3.5,2,3.5,9.5,0.01,0.25,null,null,0.08,0.32,0.08,3,null,19,37,6,0.1,null,null,null,null,12]
["Corn Germ Meal (Cargill)",8.8000000000000007,null,0.35,0.23,7.4,3.1,null,null,null,null,null,null,null,null,null,null,null,null,null,null,null,null,null,null,null,11.5]
["Corn Germ Meal (wet mill)",22.8,null,0.9,0.6,1,7.8,13.2,37.700000000000003,0.3,0.5,null,0.04,0.16,0.3,0.32,4,null,100,330,4,null,null,null,null,null,11.1]
["Corn Gluten Feed (16% CP)",16,null,0.6,0.5,3,8,11,33,0.15,0.75,null,null,0.28999999999999998,0.6,0.16,5,null,65,160,24,null,null,null,null,null,10]
["Corn Gluten Feed (18% CP)",18,null,0.6,0.5,3,8,11,33,0.15,0.75,null,null,0.28999999999999998,0.6,0.16,5,null,65,160,24,null,null,null,null,null,10]
["Corn Gluten Feed (20% CP)",20,null,0.6,0.5,3,8,11,33,0.15,0.75,null,null,0.28999999999999998,0.6,0.16,5,null,65,160,24,null,null,null,null,null,10]
["Corn Gluten Meal",63.5,null,1,1.9,2,2.5,4.5999999999999996,8.6,0.02,0.5,null,0.03,0.15,0.45,0.5,22,null,40,400,4,null,null,null,null,null,9]
["Cottonseed Delinted",22.5,null,0.7,0.2,21.4,15.4,27.6,39.200000000000003,0.1,0.48,null,null,0.36,1.06,0.23,7,null,37,100,17,null,null,null,null,null,10]
["Cottonseed Hulls",5,null,0.18,0.06,1.7,49,60.3,73,0.13,7.0000000000000007E-2,null,0.02,0.13,0.85,null,10,null,17,null,null,null,null,null,null,null,10]
["Cottonseed Meal",41,null,1.76,0.46,1.5,11,16,23,0.15,1,null,0.04,0.47,1.26,0.3,16,null,60,90,21,null,null,null,null,null,10]
["Cottonseed, Whole",21,null,0.7,0.2,20,18,37,49,0.14000000000000001,0.5,null,0.01,0.32,1.1000000000000001,0.23,25,null,30,100,17,null,null,null,null,null,10]
["Dicalcium Phosphate",null,null,null,null,null,null,null,null,21.5,18.5,null,null,null,null,null,null,null,null,null,null,null,null,null,null,null,5]
["Distillers DG w/sol Beverage",25,null,0.6,1,9,8,18,34,0.08,0.64,null,0.03,0.18,0.63,0.3,20,null,81,180,29,0.22,null,null,null,null,9]
["Distillers DG w/sol Ethanol",27,null,0.6,0.5,9,8,18,34,0.09,0.8,null,0.06,0.27,1,0.53,12,null,65,140,33,0.46,null,null,null,null,9]
["Dried Whey",12,null,0.9,0.18,0.8,0.1,0.1,null,0.9,0.75,null,1.3,0.13,1.2,1,43,null,3,160,7,null,null,null,null,null,6]
["DYNA-K KCl",null,null,null,null,null,null,null,null,null,null,null,null,0.3,50.3,null,null,null,null,null,null,null,null,null,null,null,5]
["EDDI 9.2% Premix",null,null,null,null,null,null,null,null,null,null,90,36,null,null,null,null,null,null,null,null,null,71760]
["Fish Meal Menhaden",60,null,4.5999999999999996,1.7,7.5,1,3,20,5.2,2.9,null,0.68,0.14000000000000001,0.73,0.45,8,null,92,880,40,null,null,null,null,null,10]
["Hominy Feed",9,null,0.34,0.15,6,4,6,18,0.04,0.5,null,null,0.23,0.63,null,3,null,49,65,15,null,null,null,null,null,10]
["Lysine HCl",null,null,80,null,null,null,null,null,null,null,null,null,null,null,null,null,null,null,null,null,null,null,null,null,null,5]
["Magnesium Oxide 54",null,null,null,null,null,null,null,null,null,null,null,null,54,null,null,null,null,null,null,null,null,null,null,null,null,5]
["Mag Pot Sulfate",null,null,null,null,null,null,null,null,0.05,null,null,0.75,11.5,18.5,22,null,null,10,100,20,null,null,null,null,null,5]
["Meat & Bone Meal",50,null,2.4,0.65,9.5,2.8,4,20,8.9,4.4000000000000004,null,0.8,1.1000000000000001,1.4,0.4,3,null,90,500,12,null,null,null,null,null,10]
["Millet",11,null,0.23,0.31,3.5,6.1,8,13,0.03,0.31,null,0.04,0.16,0.43,0.13,26,null,18,40,29,0.5,null,null,null,null,10]
["Mineral-Vitamin Premix",null,null,null,null,null,null,null,null,20,5,25,9.84,2.5,1.5,null,800,50,3250,null,3250,null,null,250000,100000,500,5]
["Mono-dical Phosphate",null,null,null,null,null,null,null,null,16,21,null,null,null,null,null,null,null,null,null,null,null,null,null,null,null,5]
["Oat Meal Byproduct",4.5,null,0.1,0.1,2,22,37,50,0.08,0.2,null,null,0.15,0.25,null,2,null,10,null,null,null,null,null,null,null,10]
["Oats",10,null,0.32,0.18,4,10,13,25,0.05,0.34,null,0.02,0.1,0.35,null,3,null,21,80,33,0.03,null,null,null,null,11]
["Rice Bran",12,null,0.5,0.2,10,13,15,25,0.06,1.4,null,0.1,0.95,1.74,0.18,12,null,33,190,200,0.7,null,null,null,null,10]
["Rice Hulls",2.8,null,0,0,0.8,42.9,72,85,0.23,0.06,null,0.08,0.2,0.31,0.08,3,null,24,null,null,null,null,null,null,null,10]
["Safflower Seed Meal",22,null,0.88,0.33,35,26,35,50,0.26,0.67,null,0.05,0.36,0.79,0.1,25,null,15,500,17,null,null,null,null,null,10]
["Salt (NaCl)",null,null,null,null,null,null,null,null,null,null,100,39.340000000000003,null,null,null,null,null,null,null,null,null,null,null,null,null,5]
["Selenium Premix 600",null,null,null,null,null,null,null,null,null,null,null,null,null,null,null,null,600,null,null,null,null,null,null,null,null,5]
["Sodium Bentonite",null,null,null,null,null,null,null,null,null,null,null,11,null,null,null,null,null,null,null,null,null,null,null,null,null,5]
["Sodium Bicarbonate",null,null,null,null,null,null,null,null,null,null,null,27,null,null,null,null,null,null,null,null,null,null,null,null,null,5]
["Sorghum/Milo",9.1999999999999993,null,0.22,0.17,2.9,3,5,8,0.03,0.28999999999999998,null,0.03,0.15,0.35,0.09,10,null,15,52,13,0.6,null,null,null,null,10]
["Soy Hulls",10.5,null,0.54,0.12,2.5,34,47,59,0.5,0.17,null,0.17,0.1,1.1599999999999999,0.12,17,null,30,450,20,0.1,null,null,null,null,10]
["Soybean Meal 44",44,null,3,0.65,0.5,7.5,10,16,0.3,0.6,null,0.01,0.27,1.92,null,22,null,57,90,40,0.5,null,null,null,null,10]
["Soybean Meal 46.5",46.5,null,3.15,0.7,2.75,4.2,8,12,0.4,0.65,null,0.01,0.27,2,null,15,null,45,90,40,0.5,null,null,null,null,11]
["Soybean Meal 47.5",47.5,null,3.2,0.72,2.75,4,8,12,0.4,0.65,null,0.01,0.27,2,null,15,null,45,90,40,0.5,null,null,null,null,11]
["Sunflower (Black)",18,null,0.72,0.27,27.7,31,39,49,0.17,0.52," ",0.01,0.2,0.66,0.2,25,null,15,100,25,0.4,null,null,null,null,10]
["Sunflower (Stripe)",28,null,1.1200000000000001,0.2,20,26,29,39,0.17,0.52,null,0.01,0.2,0.66,0.2,25,null,15,100,25,0.4,null,null,null,null,10]
["Sunflower Meal Solvent",42,null,1.7,1.5,2.2999999999999998,21,28,38.5,0.4,0.65,null,0.2,0.75,1,null,35,null,100,110,23,0.5,null,null,null,null,11]
["TNT Swine PMX 75",15,null,3.6,null,3,3,null,null,15,3.5,11.25,{"$f":"($M$47/100)*(L59)","v":4.4257500000000007},null,null,null,null,7.3,1900,null,null,null,null,null,null,null,5]
["TNT Swine PMX 75(E)",15,null,3.6,null,3,3,null,null,18,6.4,11.25,4.4257500000000007,null,null,null,null,7.3,1900,null,null,null,null,null,null,null,5]
["Urea 46%",287.5,287.5,null,null,null,null,null,null,null,null,null,null,null,null,null,null,null,null,null,null,null,null,null,null,null,5]
["Vegetable Oil",0,0,0,0,100,0,0,0,0,0,0,0,0,0,0,0,0,0,0,0,0]
["Vitamin A 650 Premix",null,null,null,null,null,null,null,null,null,null,null,null,null,null,null,null,null,null,null,null,null,null,295100000,null,null,5]
["Vitamin ADE Premix",null,null,null,null,null,null,null,null,null,null,null,null,null,null,null,null,null,null,null,null,null,null,5250000,1550000,5000,5]
["Wheat",11,null,0.34,0.24,1.7,3,4,13,0.05,0.35,null,0.06,0.1,0.45,0.1,7,null,30,43,30,null,null,null,null,null,10]
["Wheat Bran",14,null,0.56999999999999995,0.11,3,11,12,35,0.1,1.1499999999999999,null,0.06,0.55000000000000004,1.2,0.22,10,null,95,170,100,null,null,null,null,null,10]
["Wheat Midds",15,null,0.75,0.26,3.5,8.5,12,34,0.1,0.85,null,0.06,0.25,1,0.16,10,null,85,60,100,null,null,null,null,null,10]
["Wheat Screenings",11,null,0.48,0.12,5.0999999999999996,6.2,8,26,0.05,0.35,null,0.06,0.22,0.45,null,4,null,23,35,28,null,null,null,null,null,11]
["Yeast",14,null,0.65,0.2,3.5,6,8,13,0.28000000000000003,0.71,null,0.1,0.13,1.2,0.24,43,null,3,150,5,null,null,null,null,null,10]
["TM Salt",null,null,null,null,null,null,null,null,null,null,96.5,37.963100000000004,null,null,null,300,null,3500,2000,2000,50,null,null,null,null,5]
["Flaxseed",22,null,0.92,0.42,34,6.5,8,15,0.25,0.5,null,0.08,0.5,1.5,null,22,null,91,236,85,null,null,null,null,null,8]
["Soybeans Roasted",38,null,2.4,0.54,18,5,10,15,0.25,0.59,null,0.04,0.21,1.7,0.3,15,null,35,75,30,null,null,null,null,null,10]
["Peanut Pieces",30,null,1.9,0.4,50,2.5,5,12.5,0.05,0.4,null,null,0.18,0.65,null,5,null,30,25,20,null,null,null,null,null,5]
["Apple, whole",0.26,null,null,null,0.17,1.2,2.4,8,null,null,null,null,null,null,null,null,null,null,null,null,null,null,null,null,null,88.3]
["Carrots",0.93,null,null,null,0.24,2.4,4.8,12,null,null,null,null,null,null,null,null,null,null,null,null,null,null,null,null,null,85.6]
["Oyster Shell",null,null,null,null,null,null,null,null,37.619999999999997,7.0000000000000007E-2,null,0.21,0.3,0.1,null,null,null,null,null,null,null,null,null,null,null,0]
["Sugar",0,null,null,null,0,0,null,null,null,null,null,null,null,null,null,null,null,null,null,null,null,null,null,null,null,9]
["Distillers DG w/sol TCF",25,null,0.6,1,7,11,18,34,0.08,0.64,null,0.03,0.18,0.63,0.3,40,null,81,180,29,0.22,null,null,null,null,9]
["Oats PP",8,null,0.32,0.18,3.5,13,18,25,0.25,0.2,null,0.25,0.1,0.35,null,3,null,21,80,33,0.03,null,null,null,null,11]
["Rice Bran MaxEGlo",13,null,0.5,0.2,18,8.5,12,20,1.5,1.5,null,0.1,0.95,1.74,0.18,12,null,33,190,200,0.7,null,null,null,50,10]
["Soybean Meal 47.5 SS",47.5,null,3.2,0.72,0.5,4,8,12,0.4,0.65,null,0.01,0.27,2,null,15,null,45,90,40,0.5,null,null,null,null,11]
["Sunflower (Black) TG",15,null,0.72,0.27,23,32,40,50,0.17,0.52,0,0.01,0.2,0.66,0.2,25,null,15,100,25,0.4,null,null,null,null,10]
["Acorns",4.5,null,null,null,7.5,15,17,30,0.15,0.1,null,null,null,null,null,null,null,null,null,null,null,null,null,null,null,25]
["Potassium magnesium sulfate",0,null,0,null,0,0,0,0,0.06,0,null,0.76,11.6,18.5,22.3,null,null,10,100,20,null,null,null,null,null,2]
["zBlank10"]
["zBlank11"]
["zBlank12"]
["zBlank13"]
["zBlank14"]
["zBlank15"]
["…..COMMERCIAL FEEDS….."]
["zBlank16"]
["zBlank17"]
["zBlank18"]
["zBlank19"]
["zBlank20"]
["zBlank21"]
["zBlank22"]
["zBlank23"]
["zBlank24"]
["zBlank25"]
["zBlank26"]
["zBlank27"]
["zBlank28"]
["zBlank29"]
["zBlank30"]
["..MEDICATIONS TYPE B/C.."]
["CTC 2 g/lb",10,null,null,null,null,null,null,null,2.25,0.7,null,0.05,0.3,0.9,null,8,null,65,300,80,0.5,null,null,null,null,5,4000]
["CTC 4 g/lb",10,null,null,null,null,null,null,null,2.25,0.7,null,0.05,0.3,0.9,null,8,null,65,300,80,0.5,null,null,null,null,5,8000]
["CTC 10 g/lb",10,null,null,null,null,null,null,null,2.25,0.7,null,0.05,0.3,0.9,null,8,null,65,300,80,0.5,null,null,null,null,5,20000]
["AS 70",null,null,null,null,null,null,null,null,null,null,null,null,null,null,null,null,null,null,null,null,null,null,null,null,null,5,7000,7000]
["BMD Type B",10,null,null,null,2,10,12,null,null,null,null,null,null,null,null,null,null,null,null,null,null,null,null,null,null,5,null,null,null,null,null,5000]
["Rumensin 90 (Type A)",null,null,null,null,null,null,null,null,null,null,null,null,null,null,null,null,null,null,null,null,null,null,null,null,null,5,null,null,{"$f":"90.7*2000","v":181400}]
["Bovatec 91 (Type A)",null,null,null,null,null,null,null,null,null,null,null,null,null,null,null,null,null,null,null,null,null,null,null,null,null,5,null,null,null,{"$f":"90.7*2000","v":181400}]
["Amprolium 2.5%",18,null,0.6,0.5,3,8,11,33,0.15,0.75,null,null,0.28999999999999998,0.6,0.16,35,null,65,160,24,null,null,null,null,null,10,null,null,null,null,null,null,{"$f":"11.34*2000","v":22680}]
["Rumensin (Type B)",null,null,null,null,null,null,null,null,null,null,null,null,null,null,null,null,null,null,null,null,null,null,null,null,null,10,null,null,5000]
["Bovatec (Type B)",null,null,null,null,null,null,null,null,null,null,null,null,null,null,null,null,null,null,null,null,null,null,null,null,null,10,null,null,null,5000]
["zBlank31"]
["zBlank32"]
["zBlank33"]
["zBlank34"]
["zBlank35"]
["zBlank36"]
["zBlank37"]
["No feed"]

{"sheet":"Old_to_New_Feed_Ingredient_Conv","index":5,"n_rows":40,"n_cols":34,"rows_kept":40,"cut":false,"hidden":false,"merged":[]}
["Old ingredient format","% Protein","% NPN","% Lysine","% Fat","% Fiber","% ADF","% Ca","% Phos","% Salt","% Mg","% K","Cu ppm","Sel. ppm","Zn ppm","Meth.","Vit.A IU/lb","Vit.D IU/lb","Vit.E IU/lb"]
["Alfalfa Hay",15,null,0.6,1.7,29,39,1.25,0.2,null,0.22,1.75,10,null,20,0.2]
["Alfalfa Meal",17,null,0.73,2.75,25,35,1.3,0.23,null,0.28999999999999998,2.2999999999999998,10,null,21,0.22]
["Barley",11,null,0.4,1.8,6,7,7.0000000000000007E-2,0.36,null,0.13,0.44,8,null,20,0.12]
[]
[]
[]
[]
[]
[]
[]
[]
[]
[]
[]
[]
[]
[]
[]
[]
["New ingredient format","Crude protein %","NPN %","Lysine %","Methionine %","CrudeFat %","Crude Fiber %","ADF %","NDF %","Ca %","P %","Salt %","Na %","Mg %","K %","S %","Cu ppm","Se ppm","Zn ppm","Fe ppm","Mn ppm","Co ppm","I ppm","Vit A IU/lb","Vit D IU/lb","Vit E IU/lb","Moisture %","CTC g/ton","Sulfamethazine g/ton","Monensin g/ton","Lasalocid g/ton","Deccox g/ton","Bacitracin g/ton","Amprolium g/ton"]
[{"$f":"A2","v":"Alfalfa Hay"},{"$f":"B2","v":15},{"$f":"C2","v":0},{"$f":"D2","v":0.6},{"$f":"P2","v":0.2},{"$f":"E2","v":1.7},{"$f":"F2","v":29},{"$f":"G2","v":39},null,{"$f":"H2","v":1.25},{"$f":"I2","v":0.2},{"$f":"J2","v":0},null,{"$f":"K2","v":0.22},{"$f":"L2","v":1.75},null,{"$f":"M2","v":10},{"$f":"N2","v":0},{"$f":"O2","v":20},null,null,null,null,{"$f":"Q2","v":0},{"$f":"R2","v":0},0]
[{"$f":"A3","v":"Alfalfa Meal"},17,0,0.73,{"$f":"P3","v":0.22},{"$f":"E3","v":2.75},25,35,null,{"$f":"H3","v":1.3},0.23,0,null,{"$f":"K3","v":0.28999999999999998},2.2999999999999998,null,{"$f":"M3","v":10},0,21,null,null,null,null,{"$f":"Q3","v":0},{"$f":"R3","v":0},{"$f":"S3","v":0}]
["Barley",11,0,0.4,0.12,{"$f":"E4","v":1.8},6,7,null,{"$f":"H4","v":7.0000000000000007E-2},0.36,0,null,{"$f":"K4","v":0.13},0.44,null,{"$f":"M4","v":8},0,20,null,null,null,null,0,0,0]
[{"$f":"A5","v":0},0,0,0,{"$f":"P5","v":0},{"$f":"E5","v":0},0,0,0,19.25,{"$f":"I5","v":0},17.600000000000001,7.4,{"$f":"K5","v":0},{"$f":"L5","v":0},null,750,{"$f":"N5","v":0},2900,2400,2700,29,63,{"$f":"Q5","v":0},{"$f":"R5","v":0},{"$f":"S5","v":0}]
[{"$f":"A6","v":0},0,0,0,0,{"$f":"E6","v":0},0,0,0,24,0,14.5,6,0.5,0.3,null,{"$f":"M6","v":0},0,{"$f":"O6","v":0},2900,400,2.5,null,20000,0,10]
[{"$f":"A7","v":0},0,0,0,0,{"$f":"E7","v":0},0,0,null,{"$f":"H7","v":0},0,{"$f":"J7","v":0},null,0,0,null,0,0,0,null,null,null,null,0,0,0]
[{"$f":"A8","v":0},0,0,0,0,{"$f":"E8","v":0},0,0,null,0,0,0,null,0,0,null,0,0,0,null,null,null,null,0,0,0]
[{"$f":"A9","v":0},0,0,0,0,{"$f":"E9","v":0},0,0,null,0,0,0,null,0,0,null,0,0,0,null,null,null,null,0,0,0]
[{"$f":"A10","v":0},0,0,0,0,{"$f":"E10","v":0},0,0,null,0,0,0,null,0,0,null,0,0,0,null,null,null,null,0,0,0]
[{"$f":"A11","v":0},0,0,0,0,{"$f":"E11","v":0},0,0,null,0,0,0,null,0,0,null,0,0,0,null,null,null,null,0,0,0]
[{"$f":"A12","v":0},0,0,0,0,{"$f":"E12","v":0},0,0,null,0,0,0,null,0,0,null,0,0,0,null,null,null,null,0,0,0]
[{"$f":"A13","v":0},0,0,0,0,{"$f":"E13","v":0},0,0,null,0,0,0,null,0,0,null,0,0,0,null,null,null,null,0,0,0]
[{"$f":"A14","v":0},0,0,0,0,{"$f":"E14","v":0},0,0,null,0,0,0,null,0,0,null,0,0,0,null,null,null,null,0,0,0]
[{"$f":"A15","v":0},0,0,0,0,{"$f":"E15","v":0},0,0,null,0,0,0,null,0,0,null,0,0,0,null,null,null,null,0,0,0]
[{"$f":"A16","v":0},0,0,0,0,{"$f":"E16","v":0},0,0,null,0,0,0,null,0,0,null,0,0,0,null,null,null,null,0,0,0]
[{"$f":"A17","v":0},0,0,0,0,{"$f":"E17","v":0},0,0,null,0,0,0,null,0,0,null,0,0,0,null,null,null,null,0,0,0]
[{"$f":"A18","v":0},0,0,0,0,{"$f":"E18","v":0},0,0,null,0,0,0,null,0,0,null,0,0,0,null,null,null,null,0,0,0]
[{"$f":"A19","v":0},0,0,0,0,{"$f":"E19","v":0},0,0,null,0,0,0,null,0,0,null,0,0,0,null,null,null,null,0,0,0]
[{"$f":"A20","v":0},0,0,0,0,{"$f":"E20","v":0},0,0,null,0,0,0,null,0,0,null,0,0,0,null,null,null,null,0,0,0]

{"sheet":"Calculation Sheet","index":6,"n_rows":36,"n_cols":36,"rows_kept":36,"cut":false,"hidden":false,"merged":[]}
[]
[]
[]
[{"$f":"SUM(A7:A37)","v":2000},null,2,{"$f":"C4+1","v":3},{"$f":"D4+1","v":4},5,6,7,8,9,10,11,12,13,14,15,16,17,18,19,20,21,22,23,24,25,26,{"$f":"AA4+2","v":28},{"$f":"AB4+1","v":29},{"$f":"AC4+1","v":30},{"$f":"AD4+1","v":31},{"$f":"AE4+1","v":32},{"$f":"AF4+1","v":33},34,null,27]
["Calculated Values",null,{"$f":"'Feed Ingredients'!B1","v":"Crude protein %"},{"$f":"'Feed Ingredients'!C1","v":"NPN %"},{"$f":"'Feed Ingredients'!D1","v":"Lysine %"},{"$f":"'Feed Ingredients'!E1","v":"Methionine %"},{"$f":"'Feed Ingredients'!F1","v":"CrudeFat %"},{"$f":"'Feed Ingredients'!G1","v":"Crude Fiber %"},{"$f":"'Feed Ingredients'!H1","v":"ADF %"},{"$f":"'Feed Ingredients'!I1","v":"NDF %"},{"$f":"'Feed Ingredients'!J1","v":"Ca %"},{"$f":"'Feed Ingredients'!K1","v":"P %"},{"$f":"'Feed Ingredients'!L1","v":"Salt %"},{"$f":"'Feed Ingredients'!M1","v":"Na %"},{"$f":"'Feed Ingredients'!N1","v":"Mg %"},{"$f":"'Feed Ingredients'!O1","v":"K %"},{"$f":"'Feed Ingredients'!P1","v":"S %"},{"$f":"'Feed Ingredients'!Q1","v":"Cu ppm"},{"$f":"'Feed Ingredients'!R1","v":"Se ppm"},{"$f":"'Feed Ingredients'!S1","v":"Zn ppm"},{"$f":"'Feed Ingredients'!T1","v":"Fe ppm"},{"$f":"'Feed Ingredients'!U1","v":"Mn ppm"},{"$f":"'Feed Ingredients'!V1","v":"Co ppm"},{"$f":"'Feed Ingredients'!W1","v":"I ppm"},{"$f":"'Feed Ingredients'!X1","v":"Vit A IU/lb"},{"$f":"'Feed Ingredients'!Y1","v":"Vit D IU/lb"},{"$f":"'Feed Ingredients'!Z1","v":"Vit E IU/lb"},{"$f":"'Feed Ingredients'!AB1","v":"CTC g/ton"},{"$f":"'Feed Ingredients'!AC1","v":"Sulfamethazine g/ton"},{"$f":"'Feed Ingredients'!AD1","v":"Monensin g/ton"},{"$f":"'Feed Ingredients'!AE1","v":"Lasalocid g/ton"},{"$f":"'Feed Ingredients'!AF1","v":"Deccox g/ton"},{"$f":"'Feed Ingredients'!AG1","v":"Bacitracin g/ton"},{"$f":"'Feed Ingredients'!AH1","v":"Amprolium g/ton"},null,{"$f":"'Feed Ingredients'!AA1","v":"Moisture %"}]
["Pounds","Ingredients",{"$f":"(($A$7*C7)+($A$8*C8)+($A$9*C9)+($A$10*C10)+($A$11*C11)+($A$12*C12)+($A$13*C13)+($A$14*C14)+($A$15*C15)+($A$16*C16)+($A$17*C17)+($A$18*C18)+($A$19*C19)+($A$20*C20)+($A$21*C21)+($A$22*C22)+($A$23*C23)+($A$24*C24)+($A$25*C25)+($A$26*C26)+($A$27*C27)+($A$28*C28)+($A$29*C29)+($A$30*C30)+($A$31*C31)+($A$32*C32)+($A$33*C33)+($A$34*C34)+($A$35*C35)+($A$36*C36)+($A$37*C37))/$A4","v":15.842499999999999},{"$f":"(($A$7*D7)+($A$8*D8)+($A$9*D9)+($A$10*D10)+($A$11*D11)+($A$12*D12)+($A$13*D13)+($A$14*D14)+($A$15*D15)+($A$16*D16)+($A$17*D17)+($A$18*D18)+($A$19*D19)+($A$20*D20)+($A$21*D21)+($A$22*D22)+($A$23*D23)+($A$24*D24)+($A$25*D25)+($A$26*D26)+($A$27*D27)+($A$28*D28)+($A$29*D29)+($A$30*D30)+($A$31*D31)+($A$32*D32)+($A$33*D33)+($A$34*D34)+($A$35*D35)+($A$36*D36)+($A$37*D37))/$A4","v":0},0.69450000000000001,0.39165,3.8497499999999998,10.435,15.938750000000001,26.643750000000001,0.66962500000000003,0.400225,0.99124999999999996,0.43245775000000003,0.1525,0.78349999999999997,0.13069999999999998,11.5375,0,48.457500000000003,172.16249999999999,23.905000000000001,0.26424999999999998,0,0,0,0,0,0,0,0,0,0,0,null,{"$f":"(($A$7*AJ7)+($A$8*AJ8)+($A$9*AJ9)+($A$10*AJ10)+($A$11*AJ11)+($A$12*AJ12)+($A$13*AJ13)+($A$14*AJ14)+($A$15*AJ15)+($A$16*AJ16)+($A$17*AJ17)+($A$18*AJ18)+($A$19*AJ19)+($A$20*AJ20)+($A$21*AJ21)+($A$22*AJ22)+($A$23*AJ23)+($A$24*AJ24)+($A$25*AJ25)+($A$26*AJ26)+($A$27*AJ27)+($A$28*AJ28)+($A$29*AJ29)+($A$30*AJ30)+($A$31*AJ31)+($A$32*AJ32)+($A$33*AJ33)+($A$34*AJ34)+($A$35*AJ35)+($A$36*AJ36)+($A$37*AJ37))/$A4","v":10.547499999999999}]
[{"$f":"INPUT!F6","v":725},{"$f":"INPUT!E6","v":"Corn (7% CP)"},{"$f":"VLOOKUP($B7,'Feed Ingredients'!$A$2:$AA$125,(C$4), FALSE)","v":7},{"$f":"VLOOKUP($B7,'Feed Ingredients'!$A$2:$AA$125,(D$4), FALSE)","v":0},{"$f":"VLOOKUP($B7,'Feed Ingredients'!$A$2:$AA$125,(E$4), FALSE)","v":0.24},{"$f":"VLOOKUP($B7,'Feed Ingredients'!$A$2:$AA$125,(F$4), FALSE)","v":0.2},{"$f":"VLOOKUP($B7,'Feed Ingredients'!$A$2:$AA$125,(G$4), FALSE)","v":3.5},{"$f":"VLOOKUP($B7,'Feed Ingredients'!$A$2:$AA$125,(H$4), FALSE)","v":2},{"$f":"VLOOKUP($B7,'Feed Ingredients'!$A$2:$AA$125,(I$4), FALSE)","v":3.5},{"$f":"VLOOKUP($B7,'Feed Ingredients'!$A$2:$AA$125,(J$4), FALSE)","v":9.5},{"$f":"VLOOKUP($B7,'Feed Ingredients'!$A$2:$AA$125,(K$4), FALSE)","v":0.01},{"$f":"VLOOKUP($B7,'Feed Ingredients'!$A$2:$AA$125,(L$4), FALSE)","v":0.25},{"$f":"VLOOKUP($B7,'Feed Ingredients'!$A$2:$AA$125,(M$4), FALSE)","v":0},{"$f":"VLOOKUP($B7,'Feed Ingredients'!$A$2:$AA$125,(N$4), FALSE)","v":0},{"$f":"VLOOKUP($B7,'Feed Ingredients'!$A$2:$AA$125,(O$4), FALSE)","v":0.08},{"$f":"VLOOKUP($B7,'Feed Ingredients'!$A$2:$AA$125,(P$4), FALSE)","v":0.32},{"$f":"VLOOKUP($B7,'Feed Ingredients'!$A$2:$AA$125,(Q$4), FALSE)","v":0.08},{"$f":"VLOOKUP($B7,'Feed Ingredients'!$A$2:$AA$125,(R$4), FALSE)","v":3},{"$f":"VLOOKUP($B7,'Feed Ingredients'!$A$2:$AA$125,(S$4), FALSE)","v":0},{"$f":"VLOOKUP($B7,'Feed Ingredients'!$A$2:$AA$125,(T$4), FALSE)","v":19},{"$f":"VLOOKUP($B7,'Feed Ingredients'!$A$2:$AA$125,(U$4), FALSE)","v":37},{"$f":"VLOOKUP($B7,'Feed Ingredients'!$A$2:$AA$125,(V$4), FALSE)","v":6},{"$f":"VLOOKUP($B7,'Feed Ingredients'!$A$2:$AA$125,(W$4), FALSE)","v":0.1},{"$f":"VLOOKUP($B7,'Feed Ingredients'!$A$2:$AA$125,(X$4), FALSE)","v":0},{"$f":"VLOOKUP($B7,'Feed Ingredients'!$A$2:$AA$125,(Y$4), FALSE)","v":0},{"$f":"VLOOKUP($B7,'Feed Ingredients'!$A$2:$AA$125,(Z$4), FALSE)","v":0},{"$f":"VLOOKUP($B7,'Feed Ingredients'!$A$2:$AH$125,(AA$4), FALSE)","v":0},{"$f":"VLOOKUP($B7,'Feed Ingredients'!$A$2:$AH$125,(AB$4), FALSE)","v":0},{"$f":"VLOOKUP($B7,'Feed Ingredients'!$A$2:$AH$125,(AC$4), FALSE)","v":0},{"$f":"VLOOKUP($B7,'Feed Ingredients'!$A$2:$AH$125,(AD$4), FALSE)","v":0},{"$f":"VLOOKUP($B7,'Feed Ingredients'!$A$2:$AH$125,(AE$4), FALSE)","v":0},{"$f":"VLOOKUP($B7,'Feed Ingredients'!$A$2:$AH$125,(AF$4), FALSE)","v":0},{"$f":"VLOOKUP($B7,'Feed Ingredients'!$A$2:$AH$125,(AG$4), FALSE)","v":0},{"$f":"VLOOKUP($B7,'Feed Ingredients'!$A$2:$AH$125,(AH$4), FALSE)","v":0},null,{"$f":"VLOOKUP($B7,'Feed Ingredients'!$A$2:$AH$125,(AJ$4), FALSE)","v":12}]
[{"$f":"INPUT!F7","v":300},{"$f":"INPUT!E7","v":"Corn Gluten Feed (18% CP)"},{"$f":"VLOOKUP($B8,'Feed Ingredients'!$A$2:$AA$125,(C$4), FALSE)","v":18},{"$f":"VLOOKUP($B8,'Feed Ingredients'!$A$2:$AA$125,(D$4), FALSE)","v":0},{"$f":"VLOOKUP($B8,'Feed Ingredients'!$A$2:$AA$125,(E$4), FALSE)","v":0.6},{"$f":"VLOOKUP($B8,'Feed Ingredients'!$A$2:$AA$125,(F$4), FALSE)","v":0.5},{"$f":"VLOOKUP($B8,'Feed Ingredients'!$A$2:$AA$125,(G$4), FALSE)","v":3},{"$f":"VLOOKUP($B8,'Feed Ingredients'!$A$2:$AA$125,(H$4), FALSE)","v":8},{"$f":"VLOOKUP($B8,'Feed Ingredients'!$A$2:$AA$125,(I$4), FALSE)","v":11},{"$f":"VLOOKUP($B8,'Feed Ingredients'!$A$2:$AA$125,(J$4), FALSE)","v":33},{"$f":"VLOOKUP($B8,'Feed Ingredients'!$A$2:$AA$125,(K$4), FALSE)","v":0.15},{"$f":"VLOOKUP($B8,'Feed Ingredients'!$A$2:$AA$125,(L$4), FALSE)","v":0.75},{"$f":"VLOOKUP($B8,'Feed Ingredients'!$A$2:$AA$125,(M$4), FALSE)","v":0},{"$f":"VLOOKUP($B8,'Feed Ingredients'!$A$2:$AA$125,(N$4), FALSE)","v":0},{"$f":"VLOOKUP($B8,'Feed Ingredients'!$A$2:$AA$125,(O$4), FALSE)","v":0.28999999999999998},{"$f":"VLOOKUP($B8,'Feed Ingredients'!$A$2:$AA$125,(P$4), FALSE)","v":0.6},{"$f":"VLOOKUP($B8,'Feed Ingredients'!$A$2:$AA$125,(Q$4), FALSE)","v":0.16},{"$f":"VLOOKUP($B8,'Feed Ingredients'!$A$2:$AA$125,(R$4), FALSE)","v":5},{"$f":"VLOOKUP($B8,'Feed Ingredients'!$A$2:$AA$125,(S$4), FALSE)","v":0},{"$f":"VLOOKUP($B8,'Feed Ingredients'!$A$2:$AA$125,(T$4), FALSE)","v":65},{"$f":"VLOOKUP($B8,'Feed Ingredients'!$A$2:$AA$125,(U$4), FALSE)","v":160},{"$f":"VLOOKUP($B8,'Feed Ingredients'!$A$2:$AA$125,(V$4), FALSE)","v":24},{"$f":"VLOOKUP($B8,'Feed Ingredients'!$A$2:$AA$125,(W$4), FALSE)","v":0},{"$f":"VLOOKUP($B8,'Feed Ingredients'!$A$2:$AA$125,(X$4), FALSE)","v":0},{"$f":"VLOOKUP($B8,'Feed Ingredients'!$A$2:$AA$125,(Y$4), FALSE)","v":0},{"$f":"VLOOKUP($B8,'Feed Ingredients'!$A$2:$AA$125,(Z$4), FALSE)","v":0},{"$f":"VLOOKUP($B8,'Feed Ingredients'!$A$2:$AH$125,(AA$4), FALSE)","v":0},{"$f":"VLOOKUP($B8,'Feed Ingredients'!$A$2:$AH$125,(AB$4), FALSE)","v":0},{"$f":"VLOOKUP($B8,'Feed Ingredients'!$A$2:$AH$125,(AC$4), FALSE)","v":0},{"$f":"VLOOKUP($B8,'Feed Ingredients'!$A$2:$AH$125,(AD$4), FALSE)","v":0},{"$f":"VLOOKUP($B8,'Feed Ingredients'!$A$2:$AH$125,(AE$4), FALSE)","v":0},{"$f":"VLOOKUP($B8,'Feed Ingredients'!$A$2:$AH$125,(AF$4), FALSE)","v":0},{"$f":"VLOOKUP($B8,'Feed Ingredients'!$A$2:$AH$125,(AG$4), FALSE)","v":0},{"$f":"VLOOKUP($B8,'Feed Ingredients'!$A$2:$AH$125,(AH$4), FALSE)","v":0},null,{"$f":"VLOOKUP($B8,'Feed Ingredients'!$A$2:$AH$125,(AJ$4), FALSE)","v":10}]
[{"$f":"INPUT!F8","v":300},{"$f":"INPUT!E8","v":"Distillers DG w/sol Beverage"},{"$f":"VLOOKUP($B9,'Feed Ingredients'!$A$2:$AA$125,(C$4), FALSE)","v":25},{"$f":"VLOOKUP($B9,'Feed Ingredients'!$A$2:$AA$125,(D$4), FALSE)","v":0},{"$f":"VLOOKUP($B9,'Feed Ingredients'!$A$2:$AA$125,(E$4), FALSE)","v":0.6},{"$f":"VLOOKUP($B9,'Feed Ingredients'!$A$2:$AA$125,(F$4), FALSE)","v":1},{"$f":"VLOOKUP($B9,'Feed Ingredients'!$A$2:$AA$125,(G$4), FALSE)","v":9},{"$f":"VLOOKUP($B9,'Feed Ingredients'!$A$2:$AA$125,(H$4), FALSE)","v":8},{"$f":"VLOOKUP($B9,'Feed Ingredients'!$A$2:$AA$125,(I$4), FALSE)","v":18},{"$f":"VLOOKUP($B9,'Feed Ingredients'!$A$2:$AA$125,(J$4), FALSE)","v":34},{"$f":"VLOOKUP($B9,'Feed Ingredients'!$A$2:$AA$125,(K$4), FALSE)","v":0.08},{"$f":"VLOOKUP($B9,'Feed Ingredients'!$A$2:$AA$125,(L$4), FALSE)","v":0.64},{"$f":"VLOOKUP($B9,'Feed Ingredients'!$A$2:$AA$125,(M$4), FALSE)","v":0},{"$f":"VLOOKUP($B9,'Feed Ingredients'!$A$2:$AA$125,(N$4), FALSE)","v":0.03},{"$f":"VLOOKUP($B9,'Feed Ingredients'!$A$2:$AA$125,(O$4), FALSE)","v":0.18},{"$f":"VLOOKUP($B9,'Feed Ingredients'!$A$2:$AA$125,(P$4), FALSE)","v":0.63},{"$f":"VLOOKUP($B9,'Feed Ingredients'!$A$2:$AA$125,(Q$4), FALSE)","v":0.3},{"$f":"VLOOKUP($B9,'Feed Ingredients'!$A$2:$AA$125,(R$4), FALSE)","v":20},{"$f":"VLOOKUP($B9,'Feed Ingredients'!$A$2:$AA$125,(S$4), FALSE)","v":0},{"$f":"VLOOKUP($B9,'Feed Ingredients'!$A$2:$AA$125,(T$4), FALSE)","v":81},{"$f":"VLOOKUP($B9,'Feed Ingredients'!$A$2:$AA$125,(U$4), FALSE)","v":180},{"$f":"VLOOKUP($B9,'Feed Ingredients'!$A$2:$AA$125,(V$4), FALSE)","v":29},{"$f":"VLOOKUP($B9,'Feed Ingredients'!$A$2:$AA$125,(W$4), FALSE)","v":0.22},{"$f":"VLOOKUP($B9,'Feed Ingredients'!$A$2:$AA$125,(X$4), FALSE)","v":0},{"$f":"VLOOKUP($B9,'Feed Ingredients'!$A$2:$AA$125,(Y$4), FALSE)","v":0},{"$f":"VLOOKUP($B9,'Feed Ingredients'!$A$2:$AA$125,(Z$4), FALSE)","v":0},{"$f":"VLOOKUP($B9,'Feed Ingredients'!$A$2:$AH$125,(AA$4), FALSE)","v":0},{"$f":"VLOOKUP($B9,'Feed Ingredients'!$A$2:$AH$125,(AB$4), FALSE)","v":0},{"$f":"VLOOKUP($B9,'Feed Ingredients'!$A$2:$AH$125,(AC$4), FALSE)","v":0},{"$f":"VLOOKUP($B9,'Feed Ingredients'!$A$2:$AH$125,(AD$4), FALSE)","v":0},{"$f":"VLOOKUP($B9,'Feed Ingredients'!$A$2:$AH$125,(AE$4), FALSE)","v":0},{"$f":"VLOOKUP($B9,'Feed Ingredients'!$A$2:$AH$125,(AF$4), FALSE)","v":0},{"$f":"VLOOKUP($B9,'Feed Ingredients'!$A$2:$AH$125,(AG$4), FALSE)","v":0},{"$f":"VLOOKUP($B9,'Feed Ingredients'!$A$2:$AH$125,(AH$4), FALSE)","v":0},null,{"$f":"VLOOKUP($B9,'Feed Ingredients'!$A$2:$AH$125,(AJ$4), FALSE)","v":9}]
[{"$f":"INPUT!F9","v":400},{"$f":"INPUT!E9","v":"Soy Hulls"},{"$f":"VLOOKUP($B10,'Feed Ingredients'!$A$2:$AA$125,(C$4), FALSE)","v":10.5},{"$f":"VLOOKUP($B10,'Feed Ingredients'!$A$2:$AA$125,(D$4), FALSE)","v":0},{"$f":"VLOOKUP($B10,'Feed Ingredients'!$A$2:$AA$125,(E$4), FALSE)","v":0.54},{"$f":"VLOOKUP($B10,'Feed Ingredients'!$A$2:$AA$125,(F$4), FALSE)","v":0.12},{"$f":"VLOOKUP($B10,'Feed Ingredients'!$A$2:$AA$125,(G$4), FALSE)","v":2.5},{"$f":"VLOOKUP($B10,'Feed Ingredients'!$A$2:$AA$125,(H$4), FALSE)","v":34},{"$f":"VLOOKUP($B10,'Feed Ingredients'!$A$2:$AA$125,(I$4), FALSE)","v":47},{"$f":"VLOOKUP($B10,'Feed Ingredients'!$A$2:$AA$125,(J$4), FALSE)","v":59},{"$f":"VLOOKUP($B10,'Feed Ingredients'!$A$2:$AA$125,(K$4), FALSE)","v":0.5},{"$f":"VLOOKUP($B10,'Feed Ingredients'!$A$2:$AA$125,(L$4), FALSE)","v":0.17},{"$f":"VLOOKUP($B10,'Feed Ingredients'!$A$2:$AA$125,(M$4), FALSE)","v":0},{"$f":"VLOOKUP($B10,'Feed Ingredients'!$A$2:$AA$125,(N$4), FALSE)","v":0.17},{"$f":"VLOOKUP($B10,'Feed Ingredients'!$A$2:$AA$125,(O$4), FALSE)","v":0.1},{"$f":"VLOOKUP($B10,'Feed Ingredients'!$A$2:$AA$125,(P$4), FALSE)","v":1.1599999999999999},{"$f":"VLOOKUP($B10,'Feed Ingredients'!$A$2:$AA$125,(Q$4), FALSE)","v":0.12},{"$f":"VLOOKUP($B10,'Feed Ingredients'!$A$2:$AA$125,(R$4), FALSE)","v":17},{"$f":"VLOOKUP($B10,'Feed Ingredients'!$A$2:$AA$125,(S$4), FALSE)","v":0},{"$f":"VLOOKUP($B10,'Feed Ingredients'!$A$2:$AA$125,(T$4), FALSE)","v":30},{"$f":"VLOOKUP($B10,'Feed Ingredients'!$A$2:$AA$125,(U$4), FALSE)","v":450},{"$f":"VLOOKUP($B10,'Feed Ingredients'!$A$2:$AA$125,(V$4), FALSE)","v":20},{"$f":"VLOOKUP($B10,'Feed Ingredients'!$A$2:$AA$125,(W$4), FALSE)","v":0.1},{"$f":"VLOOKUP($B10,'Feed Ingredients'!$A$2:$AA$125,(X$4), FALSE)","v":0},{"$f":"VLOOKUP($B10,'Feed Ingredients'!$A$2:$AA$125,(Y$4), FALSE)","v":0},{"$f":"VLOOKUP($B10,'Feed Ingredients'!$A$2:$AA$125,(Z$4), FALSE)","v":0},{"$f":"VLOOKUP($B10,'Feed Ingredients'!$A$2:$AH$125,(AA$4), FALSE)","v":0},{"$f":"VLOOKUP($B10,'Feed Ingredients'!$A$2:$AH$125,(AB$4), FALSE)","v":0},{"$f":"VLOOKUP($B10,'Feed Ingredients'!$A$2:$AH$125,(AC$4), FALSE)","v":0},{"$f":"VLOOKUP($B10,'Feed Ingredients'!$A$2:$AH$125,(AD$4), FALSE)","v":0},{"$f":"VLOOKUP($B10,'Feed Ingredients'!$A$2:$AH$125,(AE$4), FALSE)","v":0},{"$f":"VLOOKUP($B10,'Feed Ingredients'!$A$2:$AH$125,(AF$4), FALSE)","v":0},{"$f":"VLOOKUP($B10,'Feed Ingredients'!$A$2:$AH$125,(AG$4), FALSE)","v":0},{"$f":"VLOOKUP($B10,'Feed Ingredients'!$A$2:$AH$125,(AH$4), FALSE)","v":0},null,{"$f":"VLOOKUP($B10,'Feed Ingredients'!$A$2:$AH$125,(AJ$4), FALSE)","v":10}]
[{"$f":"INPUT!F10","v":200},{"$f":"INPUT!E10","v":"Soybean Meal 46.5"},{"$f":"VLOOKUP($B11,'Feed Ingredients'!$A$2:$AA$125,(C$4), FALSE)","v":46.5},{"$f":"VLOOKUP($B11,'Feed Ingredients'!$A$2:$AA$125,(D$4), FALSE)","v":0},{"$f":"VLOOKUP($B11,'Feed Ingredients'!$A$2:$AA$125,(E$4), FALSE)","v":3.15},{"$f":"VLOOKUP($B11,'Feed Ingredients'!$A$2:$AA$125,(F$4), FALSE)","v":0.7},{"$f":"VLOOKUP($B11,'Feed Ingredients'!$A$2:$AA$125,(G$4), FALSE)","v":2.75},{"$f":"VLOOKUP($B11,'Feed Ingredients'!$A$2:$AA$125,(H$4), FALSE)","v":4.2},{"$f":"VLOOKUP($B11,'Feed Ingredients'!$A$2:$AA$125,(I$4), FALSE)","v":8},{"$f":"VLOOKUP($B11,'Feed Ingredients'!$A$2:$AA$125,(J$4), FALSE)","v":12},{"$f":"VLOOKUP($B11,'Feed Ingredients'!$A$2:$AA$125,(K$4), FALSE)","v":0.4},{"$f":"VLOOKUP($B11,'Feed Ingredients'!$A$2:$AA$125,(L$4), FALSE)","v":0.65},{"$f":"VLOOKUP($B11,'Feed Ingredients'!$A$2:$AA$125,(M$4), FALSE)","v":0},{"$f":"VLOOKUP($B11,'Feed Ingredients'!$A$2:$AA$125,(N$4), FALSE)","v":0.01},{"$f":"VLOOKUP($B11,'Feed Ingredients'!$A$2:$AA$125,(O$4), FALSE)","v":0.27},{"$f":"VLOOKUP($B11,'Feed Ingredients'!$A$2:$AA$125,(P$4), FALSE)","v":2},{"$f":"VLOOKUP($B11,'Feed Ingredients'!$A$2:$AA$125,(Q$4), FALSE)","v":0},{"$f":"VLOOKUP($B11,'Feed Ingredients'!$A$2:$AA$125,(R$4), FALSE)","v":15},{"$f":"VLOOKUP($B11,'Feed Ingredients'!$A$2:$AA$125,(S$4), FALSE)","v":0},{"$f":"VLOOKUP($B11,'Feed Ingredients'!$A$2:$AA$125,(T$4), FALSE)","v":45},{"$f":"VLOOKUP($B11,'Feed Ingredients'!$A$2:$AA$125,(U$4), FALSE)","v":90},{"$f":"VLOOKUP($B11,'Feed Ingredients'!$A$2:$AA$125,(V$4), FALSE)","v":40},{"$f":"VLOOKUP($B11,'Feed Ingredients'!$A$2:$AA$125,(W$4), FALSE)","v":0.5},{"$f":"VLOOKUP($B11,'Feed Ingredients'!$A$2:$AA$125,(X$4), FALSE)","v":0},{"$f":"VLOOKUP($B11,'Feed Ingredients'!$A$2:$AA$125,(Y$4), FALSE)","v":0},{"$f":"VLOOKUP($B11,'Feed Ingredients'!$A$2:$AA$125,(Z$4), FALSE)","v":0},{"$f":"VLOOKUP($B11,'Feed Ingredients'!$A$2:$AH$125,(AA$4), FALSE)","v":0},{"$f":"VLOOKUP($B11,'Feed Ingredients'!$A$2:$AH$125,(AB$4), FALSE)","v":0},{"$f":"VLOOKUP($B11,'Feed Ingredients'!$A$2:$AH$125,(AC$4), FALSE)","v":0},{"$f":"VLOOKUP($B11,'Feed Ingredients'!$A$2:$AH$125,(AD$4), FALSE)","v":0},{"$f":"VLOOKUP($B11,'Feed Ingredients'!$A$2:$AH$125,(AE$4), FALSE)","v":0},{"$f":"VLOOKUP($B11,'Feed Ingredients'!$A$2:$AH$125,(AF$4), FALSE)","v":0},{"$f":"VLOOKUP($B11,'Feed Ingredients'!$A$2:$AH$125,(AG$4), FALSE)","v":0},{"$f":"VLOOKUP($B11,'Feed Ingredients'!$A$2:$AH$125,(AH$4), FALSE)","v":0},null,{"$f":"VLOOKUP($B11,'Feed Ingredients'!$A$2:$AH$125,(AJ$4), FALSE)","v":11}]
[{"$f":"INPUT!F11","v":30},{"$f":"INPUT!E11","v":"Cane Molasses (Dried)"},{"$f":"VLOOKUP($B12,'Feed Ingredients'!$A$2:$AA$125,(C$4), FALSE)","v":7},{"$f":"VLOOKUP($B12,'Feed Ingredients'!$A$2:$AA$125,(D$4), FALSE)","v":0},{"$f":"VLOOKUP($B12,'Feed Ingredients'!$A$2:$AA$125,(E$4), FALSE)","v":0.3},{"$f":"VLOOKUP($B12,'Feed Ingredients'!$A$2:$AA$125,(F$4), FALSE)","v":0.01},{"$f":"VLOOKUP($B12,'Feed Ingredients'!$A$2:$AA$125,(G$4), FALSE)","v":0.4},{"$f":"VLOOKUP($B12,'Feed Ingredients'!$A$2:$AA$125,(H$4), FALSE)","v":6},{"$f":"VLOOKUP($B12,'Feed Ingredients'!$A$2:$AA$125,(I$4), FALSE)","v":8},{"$f":"VLOOKUP($B12,'Feed Ingredients'!$A$2:$AA$125,(J$4), FALSE)","v":10},{"$f":"VLOOKUP($B12,'Feed Ingredients'!$A$2:$AA$125,(K$4), FALSE)","v":1.1000000000000001},{"$f":"VLOOKUP($B12,'Feed Ingredients'!$A$2:$AA$125,(L$4), FALSE)","v":0.14000000000000001},{"$f":"VLOOKUP($B12,'Feed Ingredients'!$A$2:$AA$125,(M$4), FALSE)","v":0},{"$f":"VLOOKUP($B12,'Feed Ingredients'!$A$2:$AA$125,(N$4), FALSE)","v":0.2},{"$f":"VLOOKUP($B12,'Feed Ingredients'!$A$2:$AA$125,(O$4), FALSE)","v":0.4},{"$f":"VLOOKUP($B12,'Feed Ingredients'!$A$2:$AA$125,(P$4), FALSE)","v":3.4},{"$f":"VLOOKUP($B12,'Feed Ingredients'!$A$2:$AA$125,(Q$4), FALSE)","v":0.57999999999999996},{"$f":"VLOOKUP($B12,'Feed Ingredients'!$A$2:$AA$125,(R$4), FALSE)","v":70},{"$f":"VLOOKUP($B12,'Feed Ingredients'!$A$2:$AA$125,(S$4), FALSE)","v":0},{"$f":"VLOOKUP($B12,'Feed Ingredients'!$A$2:$AA$125,(T$4), FALSE)","v":28},{"$f":"VLOOKUP($B12,'Feed Ingredients'!$A$2:$AA$125,(U$4), FALSE)","v":250},{"$f":"VLOOKUP($B12,'Feed Ingredients'!$A$2:$AA$125,(V$4), FALSE)","v":52},{"$f":"VLOOKUP($B12,'Feed Ingredients'!$A$2:$AA$125,(W$4), FALSE)","v":0},{"$f":"VLOOKUP($B12,'Feed Ingredients'!$A$2:$AA$125,(X$4), FALSE)","v":0},{"$f":"VLOOKUP($B12,'Feed Ingredients'!$A$2:$AA$125,(Y$4), FALSE)","v":0},{"$f":"VLOOKUP($B12,'Feed Ingredients'!$A$2:$AA$125,(Z$4), FALSE)","v":0},{"$f":"VLOOKUP($B12,'Feed Ingredients'!$A$2:$AH$125,(AA$4), FALSE)","v":0},{"$f":"VLOOKUP($B12,'Feed Ingredients'!$A$2:$AH$125,(AB$4), FALSE)","v":0},{"$f":"VLOOKUP($B12,'Feed Ingredients'!$A$2:$AH$125,(AC$4), FALSE)","v":0},{"$f":"VLOOKUP($B12,'Feed Ingredients'!$A$2:$AH$125,(AD$4), FALSE)","v":0},{"$f":"VLOOKUP($B12,'Feed Ingredients'!$A$2:$AH$125,(AE$4), FALSE)","v":0},{"$f":"VLOOKUP($B12,'Feed Ingredients'!$A$2:$AH$125,(AF$4), FALSE)","v":0},{"$f":"VLOOKUP($B12,'Feed Ingredients'!$A$2:$AH$125,(AG$4), FALSE)","v":0},{"$f":"VLOOKUP($B12,'Feed Ingredients'!$A$2:$AH$125,(AH$4), FALSE)","v":0},null,{"$f":"VLOOKUP($B12,'Feed Ingredients'!$A$2:$AH$125,(AJ$4), FALSE)","v":9}]
[{"$f":"INPUT!F12","v":25},{"$f":"INPUT!E12","v":"Calcium Carbonate"},{"$f":"VLOOKUP($B13,'Feed Ingredients'!$A$2:$AA$125,(C$4), FALSE)","v":0},{"$f":"VLOOKUP($B13,'Feed Ingredients'!$A$2:$AA$125,(D$4), FALSE)","v":0},{"$f":"VLOOKUP($B13,'Feed Ingredients'!$A$2:$AA$125,(E$4), FALSE)","v":0},{"$f":"VLOOKUP($B13,'Feed Ingredients'!$A$2:$AA$125,(F$4), FALSE)","v":0},{"$f":"VLOOKUP($B13,'Feed Ingredients'!$A$2:$AA$125,(G$4), FALSE)","v":0},{"$f":"VLOOKUP($B13,'Feed Ingredients'!$A$2:$AA$125,(H$4), FALSE)","v":0},{"$f":"VLOOKUP($B13,'Feed Ingredients'!$A$2:$AA$125,(I$4), FALSE)","v":0},{"$f":"VLOOKUP($B13,'Feed Ingredients'!$A$2:$AA$125,(J$4), FALSE)","v":0},{"$f":"VLOOKUP($B13,'Feed Ingredients'!$A$2:$AA$125,(K$4), FALSE)","v":38},{"$f":"VLOOKUP($B13,'Feed Ingredients'!$A$2:$AA$125,(L$4), FALSE)","v":0},{"$f":"VLOOKUP($B13,'Feed Ingredients'!$A$2:$AA$125,(M$4), FALSE)","v":0},{"$f":"VLOOKUP($B13,'Feed Ingredients'!$A$2:$AA$125,(N$4), FALSE)","v":0},{"$f":"VLOOKUP($B13,'Feed Ingredients'!$A$2:$AA$125,(O$4), FALSE)","v":0},{"$f":"VLOOKUP($B13,'Feed Ingredients'!$A$2:$AA$125,(P$4), FALSE)","v":0},{"$f":"VLOOKUP($B13,'Feed Ingredients'!$A$2:$AA$125,(Q$4), FALSE)","v":0},{"$f":"VLOOKUP($B13,'Feed Ingredients'!$A$2:$AA$125,(R$4), FALSE)","v":0},{"$f":"VLOOKUP($B13,'Feed Ingredients'!$A$2:$AA$125,(S$4), FALSE)","v":0},{"$f":"VLOOKUP($B13,'Feed Ingredients'!$A$2:$AA$125,(T$4), FALSE)","v":0},{"$f":"VLOOKUP($B13,'Feed Ingredients'!$A$2:$AA$125,(U$4), FALSE)","v":0},{"$f":"VLOOKUP($B13,'Feed Ingredients'!$A$2:$AA$125,(V$4), FALSE)","v":0},{"$f":"VLOOKUP($B13,'Feed Ingredients'!$A$2:$AA$125,(W$4), FALSE)","v":0},{"$f":"VLOOKUP($B13,'Feed Ingredients'!$A$2:$AA$125,(X$4), FALSE)","v":0},{"$f":"VLOOKUP($B13,'Feed Ingredients'!$A$2:$AA$125,(Y$4), FALSE)","v":0},{"$f":"VLOOKUP($B13,'Feed Ingredients'!$A$2:$AA$125,(Z$4), FALSE)","v":0},{"$f":"VLOOKUP($B13,'Feed Ingredients'!$A$2:$AH$125,(AA$4), FALSE)","v":0},{"$f":"VLOOKUP($B13,'Feed Ingredients'!$A$2:$AH$125,(AB$4), FALSE)","v":0},{"$f":"VLOOKUP($B13,'Feed Ingredients'!$A$2:$AH$125,(AC$4), FALSE)","v":0},{"$f":"VLOOKUP($B13,'Feed Ingredients'!$A$2:$AH$125,(AD$4), FALSE)","v":0},{"$f":"VLOOKUP($B13,'Feed Ingredients'!$A$2:$AH$125,(AE$4), FALSE)","v":0},{"$f":"VLOOKUP($B13,'Feed Ingredients'!$A$2:$AH$125,(AF$4), FALSE)","v":0},{"$f":"VLOOKUP($B13,'Feed Ingredients'!$A$2:$AH$125,(AG$4), FALSE)","v":0},{"$f":"VLOOKUP($B13,'Feed Ingredients'!$A$2:$AH$125,(AH$4), FALSE)","v":0},null,{"$f":"VLOOKUP($B13,'Feed Ingredients'!$A$2:$AH$125,(AJ$4), FALSE)","v":5}]
[{"$f":"INPUT!F13","v":15},{"$f":"INPUT!E13","v":"Salt (NaCl)"},{"$f":"VLOOKUP($B14,'Feed Ingredients'!$A$2:$AA$125,(C$4), FALSE)","v":0},{"$f":"VLOOKUP($B14,'Feed Ingredients'!$A$2:$AA$125,(D$4), FALSE)","v":0},{"$f":"VLOOKUP($B14,'Feed Ingredients'!$A$2:$AA$125,(E$4), FALSE)","v":0},{"$f":"VLOOKUP($B14,'Feed Ingredients'!$A$2:$AA$125,(F$4), FALSE)","v":0},{"$f":"VLOOKUP($B14,'Feed Ingredients'!$A$2:$AA$125,(G$4), FALSE)","v":0},{"$f":"VLOOKUP($B14,'Feed Ingredients'!$A$2:$AA$125,(H$4), FALSE)","v":0},{"$f":"VLOOKUP($B14,'Feed Ingredients'!$A$2:$AA$125,(I$4), FALSE)","v":0},{"$f":"VLOOKUP($B14,'Feed Ingredients'!$A$2:$AA$125,(J$4), FALSE)","v":0},{"$f":"VLOOKUP($B14,'Feed Ingredients'!$A$2:$AA$125,(K$4), FALSE)","v":0},{"$f":"VLOOKUP($B14,'Feed Ingredients'!$A$2:$AA$125,(L$4), FALSE)","v":0},{"$f":"VLOOKUP($B14,'Feed Ingredients'!$A$2:$AA$125,(M$4), FALSE)","v":100},{"$f":"VLOOKUP($B14,'Feed Ingredients'!$A$2:$AA$125,(N$4), FALSE)","v":39.340000000000003},{"$f":"VLOOKUP($B14,'Feed Ingredients'!$A$2:$AA$125,(O$4), FALSE)","v":0},{"$f":"VLOOKUP($B14,'Feed Ingredients'!$A$2:$AA$125,(P$4), FALSE)","v":0},{"$f":"VLOOKUP($B14,'Feed Ingredients'!$A$2:$AA$125,(Q$4), FALSE)","v":0},{"$f":"VLOOKUP($B14,'Feed Ingredients'!$A$2:$AA$125,(R$4), FALSE)","v":0},{"$f":"VLOOKUP($B14,'Feed Ingredients'!$A$2:$AA$125,(S$4), FALSE)","v":0},{"$f":"VLOOKUP($B14,'Feed Ingredients'!$A$2:$AA$125,(T$4), FALSE)","v":0},{"$f":"VLOOKUP($B14,'Feed Ingredients'!$A$2:$AA$125,(U$4), FALSE)","v":0},{"$f":"VLOOKUP($B14,'Feed Ingredients'!$A$2:$AA$125,(V$4), FALSE)","v":0},{"$f":"VLOOKUP($B14,'Feed Ingredients'!$A$2:$AA$125,(W$4), FALSE)","v":0},{"$f":"VLOOKUP($B14,'Feed Ingredients'!$A$2:$AA$125,(X$4), FALSE)","v":0},{"$f":"VLOOKUP($B14,'Feed Ingredients'!$A$2:$AA$125,(Y$4), FALSE)","v":0},{"$f":"VLOOKUP($B14,'Feed Ingredients'!$A$2:$AA$125,(Z$4), FALSE)","v":0},{"$f":"VLOOKUP($B14,'Feed Ingredients'!$A$2:$AH$125,(AA$4), FALSE)","v":0},{"$f":"VLOOKUP($B14,'Feed Ingredients'!$A$2:$AH$125,(AB$4), FALSE)","v":0},{"$f":"VLOOKUP($B14,'Feed Ingredients'!$A$2:$AH$125,(AC$4), FALSE)","v":0},{"$f":"VLOOKUP($B14,'Feed Ingredients'!$A$2:$AH$125,(AD$4), FALSE)","v":0},{"$f":"VLOOKUP($B14,'Feed Ingredients'!$A$2:$AH$125,(AE$4), FALSE)","v":0},{"$f":"VLOOKUP($B14,'Feed Ingredients'!$A$2:$AH$125,(AF$4), FALSE)","v":0},{"$f":"VLOOKUP($B14,'Feed Ingredients'!$A$2:$AH$125,(AG$4), FALSE)","v":0},{"$f":"VLOOKUP($B14,'Feed Ingredients'!$A$2:$AH$125,(AH$4), FALSE)","v":0},null,{"$f":"VLOOKUP($B14,'Feed Ingredients'!$A$2:$AH$125,(AJ$4), FALSE)","v":5}]
[{"$f":"INPUT!F14","v":5},{"$f":"INPUT!E14","v":"TM Salt"},{"$f":"VLOOKUP($B15,'Feed Ingredients'!$A$2:$AA$125,(C$4), FALSE)","v":0},{"$f":"VLOOKUP($B15,'Feed Ingredients'!$A$2:$AA$125,(D$4), FALSE)","v":0},{"$f":"VLOOKUP($B15,'Feed Ingredients'!$A$2:$AA$125,(E$4), FALSE)","v":0},{"$f":"VLOOKUP($B15,'Feed Ingredients'!$A$2:$AA$125,(F$4), FALSE)","v":0},{"$f":"VLOOKUP($B15,'Feed Ingredients'!$A$2:$AA$125,(G$4), FALSE)","v":0},{"$f":"VLOOKUP($B15,'Feed Ingredients'!$A$2:$AA$125,(H$4), FALSE)","v":0},{"$f":"VLOOKUP($B15,'Feed Ingredients'!$A$2:$AA$125,(I$4), FALSE)","v":0},{"$f":"VLOOKUP($B15,'Feed Ingredients'!$A$2:$AA$125,(J$4), FALSE)","v":0},{"$f":"VLOOKUP($B15,'Feed Ingredients'!$A$2:$AA$125,(K$4), FALSE)","v":0},{"$f":"VLOOKUP($B15,'Feed Ingredients'!$A$2:$AA$125,(L$4), FALSE)","v":0},{"$f":"VLOOKUP($B15,'Feed Ingredients'!$A$2:$AA$125,(M$4), FALSE)","v":96.5},{"$f":"VLOOKUP($B15,'Feed Ingredients'!$A$2:$AA$125,(N$4), FALSE)","v":37.963100000000004},{"$f":"VLOOKUP($B15,'Feed Ingredients'!$A$2:$AA$125,(O$4), FALSE)","v":0},{"$f":"VLOOKUP($B15,'Feed Ingredients'!$A$2:$AA$125,(P$4), FALSE)","v":0},{"$f":"VLOOKUP($B15,'Feed Ingredients'!$A$2:$AA$125,(Q$4), FALSE)","v":0},{"$f":"VLOOKUP($B15,'Feed Ingredients'!$A$2:$AA$125,(R$4), FALSE)","v":300},{"$f":"VLOOKUP($B15,'Feed Ingredients'!$A$2:$AA$125,(S$4), FALSE)","v":0},{"$f":"VLOOKUP($B15,'Feed Ingredients'!$A$2:$AA$125,(T$4), FALSE)","v":3500},{"$f":"VLOOKUP($B15,'Feed Ingredients'!$A$2:$AA$125,(U$4), FALSE)","v":2000},{"$f":"VLOOKUP($B15,'Feed Ingredients'!$A$2:$AA$125,(V$4), FALSE)","v":2000},{"$f":"VLOOKUP($B15,'Feed Ingredients'!$A$2:$AA$125,(W$4), FALSE)","v":50},{"$f":"VLOOKUP($B15,'Feed Ingredients'!$A$2:$AA$125,(X$4), FALSE)","v":0},{"$f":"VLOOKUP($B15,'Feed Ingredients'!$A$2:$AA$125,(Y$4), FALSE)","v":0},{"$f":"VLOOKUP($B15,'Feed Ingredients'!$A$2:$AA$125,(Z$4), FALSE)","v":0},{"$f":"VLOOKUP($B15,'Feed Ingredients'!$A$2:$AH$125,(AA$4), FALSE)","v":0},{"$f":"VLOOKUP($B15,'Feed Ingredients'!$A$2:$AH$125,(AB$4), FALSE)","v":0},{"$f":"VLOOKUP($B15,'Feed Ingredients'!$A$2:$AH$125,(AC$4), FALSE)","v":0},{"$f":"VLOOKUP($B15,'Feed Ingredients'!$A$2:$AH$125,(AD$4), FALSE)","v":0},{"$f":"VLOOKUP($B15,'Feed Ingredients'!$A$2:$AH$125,(AE$4), FALSE)","v":0},{"$f":"VLOOKUP($B15,'Feed Ingredients'!$A$2:$AH$125,(AF$4), FALSE)","v":0},{"$f":"VLOOKUP($B15,'Feed Ingredients'!$A$2:$AH$125,(AG$4), FALSE)","v":0},{"$f":"VLOOKUP($B15,'Feed Ingredients'!$A$2:$AH$125,(AH$4), FALSE)","v":0},null,{"$f":"VLOOKUP($B15,'Feed Ingredients'!$A$2:$AH$125,(AJ$4), FALSE)","v":5}]
[{"$f":"INPUT!F15","v":0},{"$f":"INPUT!E15","v":"No feed"},{"$f":"VLOOKUP($B16,'Feed Ingredients'!$A$2:$AA$125,(C$4), FALSE)","v":0},{"$f":"VLOOKUP($B16,'Feed Ingredients'!$A$2:$AA$125,(D$4), FALSE)","v":0},{"$f":"VLOOKUP($B16,'Feed Ingredients'!$A$2:$AA$125,(E$4), FALSE)","v":0},{"$f":"VLOOKUP($B16,'Feed Ingredients'!$A$2:$AA$125,(F$4), FALSE)","v":0},{"$f":"VLOOKUP($B16,'Feed Ingredients'!$A$2:$AA$125,(G$4), FALSE)","v":0},{"$f":"VLOOKUP($B16,'Feed Ingredients'!$A$2:$AA$125,(H$4), FALSE)","v":0},{"$f":"VLOOKUP($B16,'Feed Ingredients'!$A$2:$AA$125,(I$4), FALSE)","v":0},{"$f":"VLOOKUP($B16,'Feed Ingredients'!$A$2:$AA$125,(J$4), FALSE)","v":0},{"$f":"VLOOKUP($B16,'Feed Ingredients'!$A$2:$AA$125,(K$4), FALSE)","v":0},{"$f":"VLOOKUP($B16,'Feed Ingredients'!$A$2:$AA$125,(L$4), FALSE)","v":0},{"$f":"VLOOKUP($B16,'Feed Ingredients'!$A$2:$AA$125,(M$4), FALSE)","v":0},{"$f":"VLOOKUP($B16,'Feed Ingredients'!$A$2:$AA$125,(N$4), FALSE)","v":0},{"$f":"VLOOKUP($B16,'Feed Ingredients'!$A$2:$AA$125,(O$4), FALSE)","v":0},{"$f":"VLOOKUP($B16,'Feed Ingredients'!$A$2:$AA$125,(P$4), FALSE)","v":0},{"$f":"VLOOKUP($B16,'Feed Ingredients'!$A$2:$AA$125,(Q$4), FALSE)","v":0},{"$f":"VLOOKUP($B16,'Feed Ingredients'!$A$2:$AA$125,(R$4), FALSE)","v":0},{"$f":"VLOOKUP($B16,'Feed Ingredients'!$A$2:$AA$125,(S$4), FALSE)","v":0},{"$f":"VLOOKUP($B16,'Feed Ingredients'!$A$2:$AA$125,(T$4), FALSE)","v":0},{"$f":"VLOOKUP($B16,'Feed Ingredients'!$A$2:$AA$125,(U$4), FALSE)","v":0},{"$f":"VLOOKUP($B16,'Feed Ingredients'!$A$2:$AA$125,(V$4), FALSE)","v":0},{"$f":"VLOOKUP($B16,'Feed Ingredients'!$A$2:$AA$125,(W$4), FALSE)","v":0},{"$f":"VLOOKUP($B16,'Feed Ingredients'!$A$2:$AA$125,(X$4), FALSE)","v":0},{"$f":"VLOOKUP($B16,'Feed Ingredients'!$A$2:$AA$125,(Y$4), FALSE)","v":0},{"$f":"VLOOKUP($B16,'Feed Ingredients'!$A$2:$AA$125,(Z$4), FALSE)","v":0},{"$f":"VLOOKUP($B16,'Feed Ingredients'!$A$2:$AH$125,(AA$4), FALSE)","v":0},{"$f":"VLOOKUP($B16,'Feed Ingredients'!$A$2:$AH$125,(AB$4), FALSE)","v":0},{"$f":"VLOOKUP($B16,'Feed Ingredients'!$A$2:$AH$125,(AC$4), FALSE)","v":0},{"$f":"VLOOKUP($B16,'Feed Ingredients'!$A$2:$AH$125,(AD$4), FALSE)","v":0},{"$f":"VLOOKUP($B16,'Feed Ingredients'!$A$2:$AH$125,(AE$4), FALSE)","v":0},{"$f":"VLOOKUP($B16,'Feed Ingredients'!$A$2:$AH$125,(AF$4), FALSE)","v":0},{"$f":"VLOOKUP($B16,'Feed Ingredients'!$A$2:$AH$125,(AG$4), FALSE)","v":0},{"$f":"VLOOKUP($B16,'Feed Ingredients'!$A$2:$AH$125,(AH$4), FALSE)","v":0},null,{"$f":"VLOOKUP($B16,'Feed Ingredients'!$A$2:$AH$125,(AJ$4), FALSE)","v":0}]
[{"$f":"INPUT!F16","v":0},{"$f":"INPUT!E16","v":"No feed"},{"$f":"VLOOKUP($B17,'Feed Ingredients'!$A$2:$AA$125,(C$4), FALSE)","v":0},{"$f":"VLOOKUP($B17,'Feed Ingredients'!$A$2:$AA$125,(D$4), FALSE)","v":0},{"$f":"VLOOKUP($B17,'Feed Ingredients'!$A$2:$AA$125,(E$4), FALSE)","v":0},{"$f":"VLOOKUP($B17,'Feed Ingredients'!$A$2:$AA$125,(F$4), FALSE)","v":0},{"$f":"VLOOKUP($B17,'Feed Ingredients'!$A$2:$AA$125,(G$4), FALSE)","v":0},{"$f":"VLOOKUP($B17,'Feed Ingredients'!$A$2:$AA$125,(H$4), FALSE)","v":0},{"$f":"VLOOKUP($B17,'Feed Ingredients'!$A$2:$AA$125,(I$4), FALSE)","v":0},{"$f":"VLOOKUP($B17,'Feed Ingredients'!$A$2:$AA$125,(J$4), FALSE)","v":0},{"$f":"VLOOKUP($B17,'Feed Ingredients'!$A$2:$AA$125,(K$4), FALSE)","v":0},{"$f":"VLOOKUP($B17,'Feed Ingredients'!$A$2:$AA$125,(L$4), FALSE)","v":0},{"$f":"VLOOKUP($B17,'Feed Ingredients'!$A$2:$AA$125,(M$4), FALSE)","v":0},{"$f":"VLOOKUP($B17,'Feed Ingredients'!$A$2:$AA$125,(N$4), FALSE)","v":0},{"$f":"VLOOKUP($B17,'Feed Ingredients'!$A$2:$AA$125,(O$4), FALSE)","v":0},{"$f":"VLOOKUP($B17,'Feed Ingredients'!$A$2:$AA$125,(P$4), FALSE)","v":0},{"$f":"VLOOKUP($B17,'Feed Ingredients'!$A$2:$AA$125,(Q$4), FALSE)","v":0},{"$f":"VLOOKUP($B17,'Feed Ingredients'!$A$2:$AA$125,(R$4), FALSE)","v":0},{"$f":"VLOOKUP($B17,'Feed Ingredients'!$A$2:$AA$125,(S$4), FALSE)","v":0},{"$f":"VLOOKUP($B17,'Feed Ingredients'!$A$2:$AA$125,(T$4), FALSE)","v":0},{"$f":"VLOOKUP($B17,'Feed Ingredients'!$A$2:$AA$125,(U$4), FALSE)","v":0},{"$f":"VLOOKUP($B17,'Feed Ingredients'!$A$2:$AA$125,(V$4), FALSE)","v":0},{"$f":"VLOOKUP($B17,'Feed Ingredients'!$A$2:$AA$125,(W$4), FALSE)","v":0},{"$f":"VLOOKUP($B17,'Feed Ingredients'!$A$2:$AA$125,(X$4), FALSE)","v":0},{"$f":"VLOOKUP($B17,'Feed Ingredients'!$A$2:$AA$125,(Y$4), FALSE)","v":0},{"$f":"VLOOKUP($B17,'Feed Ingredients'!$A$2:$AA$125,(Z$4), FALSE)","v":0},{"$f":"VLOOKUP($B17,'Feed Ingredients'!$A$2:$AH$125,(AA$4), FALSE)","v":0},{"$f":"VLOOKUP($B17,'Feed Ingredients'!$A$2:$AH$125,(AB$4), FALSE)","v":0},{"$f":"VLOOKUP($B17,'Feed Ingredients'!$A$2:$AH$125,(AC$4), FALSE)","v":0},{"$f":"VLOOKUP($B17,'Feed Ingredients'!$A$2:$AH$125,(AD$4), FALSE)","v":0},{"$f":"VLOOKUP($B17,'Feed Ingredients'!$A$2:$AH$125,(AE$4), FALSE)","v":0},{"$f":"VLOOKUP($B17,'Feed Ingredients'!$A$2:$AH$125,(AF$4), FALSE)","v":0},{"$f":"VLOOKUP($B17,'Feed Ingredients'!$A$2:$AH$125,(AG$4), FALSE)","v":0},{"$f":"VLOOKUP($B17,'Feed Ingredients'!$A$2:$AH$125,(AH$4), FALSE)","v":0},null,{"$f":"VLOOKUP($B17,'Feed Ingredients'!$A$2:$AH$125,(AJ$4), FALSE)","v":0}]
[{"$f":"INPUT!F17","v":0},{"$f":"INPUT!E17","v":"No feed"},{"$f":"VLOOKUP($B18,'Feed Ingredients'!$A$2:$AA$125,(C$4), FALSE)","v":0},{"$f":"VLOOKUP($B18,'Feed Ingredients'!$A$2:$AA$125,(D$4), FALSE)","v":0},{"$f":"VLOOKUP($B18,'Feed Ingredients'!$A$2:$AA$125,(E$4), FALSE)","v":0},{"$f":"VLOOKUP($B18,'Feed Ingredients'!$A$2:$AA$125,(F$4), FALSE)","v":0},{"$f":"VLOOKUP($B18,'Feed Ingredients'!$A$2:$AA$125,(G$4), FALSE)","v":0},{"$f":"VLOOKUP($B18,'Feed Ingredients'!$A$2:$AA$125,(H$4), FALSE)","v":0},{"$f":"VLOOKUP($B18,'Feed Ingredients'!$A$2:$AA$125,(I$4), FALSE)","v":0},{"$f":"VLOOKUP($B18,'Feed Ingredients'!$A$2:$AA$125,(J$4), FALSE)","v":0},{"$f":"VLOOKUP($B18,'Feed Ingredients'!$A$2:$AA$125,(K$4), FALSE)","v":0},{"$f":"VLOOKUP($B18,'Feed Ingredients'!$A$2:$AA$125,(L$4), FALSE)","v":0},{"$f":"VLOOKUP($B18,'Feed Ingredients'!$A$2:$AA$125,(M$4), FALSE)","v":0},{"$f":"VLOOKUP($B18,'Feed Ingredients'!$A$2:$AA$125,(N$4), FALSE)","v":0},{"$f":"VLOOKUP($B18,'Feed Ingredients'!$A$2:$AA$125,(O$4), FALSE)","v":0},{"$f":"VLOOKUP($B18,'Feed Ingredients'!$A$2:$AA$125,(P$4), FALSE)","v":0},{"$f":"VLOOKUP($B18,'Feed Ingredients'!$A$2:$AA$125,(Q$4), FALSE)","v":0},{"$f":"VLOOKUP($B18,'Feed Ingredients'!$A$2:$AA$125,(R$4), FALSE)","v":0},{"$f":"VLOOKUP($B18,'Feed Ingredients'!$A$2:$AA$125,(S$4), FALSE)","v":0},{"$f":"VLOOKUP($B18,'Feed Ingredients'!$A$2:$AA$125,(T$4), FALSE)","v":0},{"$f":"VLOOKUP($B18,'Feed Ingredients'!$A$2:$AA$125,(U$4), FALSE)","v":0},{"$f":"VLOOKUP($B18,'Feed Ingredients'!$A$2:$AA$125,(V$4), FALSE)","v":0},{"$f":"VLOOKUP($B18,'Feed Ingredients'!$A$2:$AA$125,(W$4), FALSE)","v":0},{"$f":"VLOOKUP($B18,'Feed Ingredients'!$A$2:$AA$125,(X$4), FALSE)","v":0},{"$f":"VLOOKUP($B18,'Feed Ingredients'!$A$2:$AA$125,(Y$4), FALSE)","v":0},{"$f":"VLOOKUP($B18,'Feed Ingredients'!$A$2:$AA$125,(Z$4), FALSE)","v":0},{"$f":"VLOOKUP($B18,'Feed Ingredients'!$A$2:$AH$125,(AA$4), FALSE)","v":0},{"$f":"VLOOKUP($B18,'Feed Ingredients'!$A$2:$AH$125,(AB$4), FALSE)","v":0},{"$f":"VLOOKUP($B18,'Feed Ingredients'!$A$2:$AH$125,(AC$4), FALSE)","v":0},{"$f":"VLOOKUP($B18,'Feed Ingredients'!$A$2:$AH$125,(AD$4), FALSE)","v":0},{"$f":"VLOOKUP($B18,'Feed Ingredients'!$A$2:$AH$125,(AE$4), FALSE)","v":0},{"$f":"VLOOKUP($B18,'Feed Ingredients'!$A$2:$AH$125,(AF$4), FALSE)","v":0},{"$f":"VLOOKUP($B18,'Feed Ingredients'!$A$2:$AH$125,(AG$4), FALSE)","v":0},{"$f":"VLOOKUP($B18,'Feed Ingredients'!$A$2:$AH$125,(AH$4), FALSE)","v":0},null,{"$f":"VLOOKUP($B18,'Feed Ingredients'!$A$2:$AH$125,(AJ$4), FALSE)","v":0}]
[{"$f":"INPUT!F18","v":0},{"$f":"INPUT!E18","v":"No feed"},{"$f":"VLOOKUP($B19,'Feed Ingredients'!$A$2:$AA$125,(C$4), FALSE)","v":0},{"$f":"VLOOKUP($B19,'Feed Ingredients'!$A$2:$AA$125,(D$4), FALSE)","v":0},{"$f":"VLOOKUP($B19,'Feed Ingredients'!$A$2:$AA$125,(E$4), FALSE)","v":0},{"$f":"VLOOKUP($B19,'Feed Ingredients'!$A$2:$AA$125,(F$4), FALSE)","v":0},{"$f":"VLOOKUP($B19,'Feed Ingredients'!$A$2:$AA$125,(G$4), FALSE)","v":0},{"$f":"VLOOKUP($B19,'Feed Ingredients'!$A$2:$AA$125,(H$4), FALSE)","v":0},{"$f":"VLOOKUP($B19,'Feed Ingredients'!$A$2:$AA$125,(I$4), FALSE)","v":0},{"$f":"VLOOKUP($B19,'Feed Ingredients'!$A$2:$AA$125,(J$4), FALSE)","v":0},{"$f":"VLOOKUP($B19,'Feed Ingredients'!$A$2:$AA$125,(K$4), FALSE)","v":0},{"$f":"VLOOKUP($B19,'Feed Ingredients'!$A$2:$AA$125,(L$4), FALSE)","v":0},{"$f":"VLOOKUP($B19,'Feed Ingredients'!$A$2:$AA$125,(M$4), FALSE)","v":0},{"$f":"VLOOKUP($B19,'Feed Ingredients'!$A$2:$AA$125,(N$4), FALSE)","v":0},{"$f":"VLOOKUP($B19,'Feed Ingredients'!$A$2:$AA$125,(O$4), FALSE)","v":0},{"$f":"VLOOKUP($B19,'Feed Ingredients'!$A$2:$AA$125,(P$4), FALSE)","v":0},{"$f":"VLOOKUP($B19,'Feed Ingredients'!$A$2:$AA$125,(Q$4), FALSE)","v":0},{"$f":"VLOOKUP($B19,'Feed Ingredients'!$A$2:$AA$125,(R$4), FALSE)","v":0},{"$f":"VLOOKUP($B19,'Feed Ingredients'!$A$2:$AA$125,(S$4), FALSE)","v":0},{"$f":"VLOOKUP($B19,'Feed Ingredients'!$A$2:$AA$125,(T$4), FALSE)","v":0},{"$f":"VLOOKUP($B19,'Feed Ingredients'!$A$2:$AA$125,(U$4), FALSE)","v":0},{"$f":"VLOOKUP($B19,'Feed Ingredients'!$A$2:$AA$125,(V$4), FALSE)","v":0},{"$f":"VLOOKUP($B19,'Feed Ingredients'!$A$2:$AA$125,(W$4), FALSE)","v":0},{"$f":"VLOOKUP($B19,'Feed Ingredients'!$A$2:$AA$125,(X$4), FALSE)","v":0},{"$f":"VLOOKUP($B19,'Feed Ingredients'!$A$2:$AA$125,(Y$4), FALSE)","v":0},{"$f":"VLOOKUP($B19,'Feed Ingredients'!$A$2:$AA$125,(Z$4), FALSE)","v":0},{"$f":"VLOOKUP($B19,'Feed Ingredients'!$A$2:$AH$125,(AA$4), FALSE)","v":0},{"$f":"VLOOKUP($B19,'Feed Ingredients'!$A$2:$AH$125,(AB$4), FALSE)","v":0},{"$f":"VLOOKUP($B19,'Feed Ingredients'!$A$2:$AH$125,(AC$4), FALSE)","v":0},{"$f":"VLOOKUP($B19,'Feed Ingredients'!$A$2:$AH$125,(AD$4), FALSE)","v":0},{"$f":"VLOOKUP($B19,'Feed Ingredients'!$A$2:$AH$125,(AE$4), FALSE)","v":0},{"$f":"VLOOKUP($B19,'Feed Ingredients'!$A$2:$AH$125,(AF$4), FALSE)","v":0},{"$f":"VLOOKUP($B19,'Feed Ingredients'!$A$2:$AH$125,(AG$4), FALSE)","v":0},{"$f":"VLOOKUP($B19,'Feed Ingredients'!$A$2:$AH$125,(AH$4), FALSE)","v":0},null,{"$f":"VLOOKUP($B19,'Feed Ingredients'!$A$2:$AH$125,(AJ$4), FALSE)","v":0}]
[{"$f":"INPUT!F19","v":0},{"$f":"INPUT!E19","v":"No feed"},{"$f":"VLOOKUP($B20,'Feed Ingredients'!$A$2:$AA$125,(C$4), FALSE)","v":0},{"$f":"VLOOKUP($B20,'Feed Ingredients'!$A$2:$AA$125,(D$4), FALSE)","v":0},{"$f":"VLOOKUP($B20,'Feed Ingredients'!$A$2:$AA$125,(E$4), FALSE)","v":0},{"$f":"VLOOKUP($B20,'Feed Ingredients'!$A$2:$AA$125,(F$4), FALSE)","v":0},{"$f":"VLOOKUP($B20,'Feed Ingredients'!$A$2:$AA$125,(G$4), FALSE)","v":0},{"$f":"VLOOKUP($B20,'Feed Ingredients'!$A$2:$AA$125,(H$4), FALSE)","v":0},{"$f":"VLOOKUP($B20,'Feed Ingredients'!$A$2:$AA$125,(I$4), FALSE)","v":0},{"$f":"VLOOKUP($B20,'Feed Ingredients'!$A$2:$AA$125,(J$4), FALSE)","v":0},{"$f":"VLOOKUP($B20,'Feed Ingredients'!$A$2:$AA$125,(K$4), FALSE)","v":0},{"$f":"VLOOKUP($B20,'Feed Ingredients'!$A$2:$AA$125,(L$4), FALSE)","v":0},{"$f":"VLOOKUP($B20,'Feed Ingredients'!$A$2:$AA$125,(M$4), FALSE)","v":0},{"$f":"VLOOKUP($B20,'Feed Ingredients'!$A$2:$AA$125,(N$4), FALSE)","v":0},{"$f":"VLOOKUP($B20,'Feed Ingredients'!$A$2:$AA$125,(O$4), FALSE)","v":0},{"$f":"VLOOKUP($B20,'Feed Ingredients'!$A$2:$AA$125,(P$4), FALSE)","v":0},{"$f":"VLOOKUP($B20,'Feed Ingredients'!$A$2:$AA$125,(Q$4), FALSE)","v":0},{"$f":"VLOOKUP($B20,'Feed Ingredients'!$A$2:$AA$125,(R$4), FALSE)","v":0},{"$f":"VLOOKUP($B20,'Feed Ingredients'!$A$2:$AA$125,(S$4), FALSE)","v":0},{"$f":"VLOOKUP($B20,'Feed Ingredients'!$A$2:$AA$125,(T$4), FALSE)","v":0},{"$f":"VLOOKUP($B20,'Feed Ingredients'!$A$2:$AA$125,(U$4), FALSE)","v":0},{"$f":"VLOOKUP($B20,'Feed Ingredients'!$A$2:$AA$125,(V$4), FALSE)","v":0},{"$f":"VLOOKUP($B20,'Feed Ingredients'!$A$2:$AA$125,(W$4), FALSE)","v":0},{"$f":"VLOOKUP($B20,'Feed Ingredients'!$A$2:$AA$125,(X$4), FALSE)","v":0},{"$f":"VLOOKUP($B20,'Feed Ingredients'!$A$2:$AA$125,(Y$4), FALSE)","v":0},{"$f":"VLOOKUP($B20,'Feed Ingredients'!$A$2:$AA$125,(Z$4), FALSE)","v":0},{"$f":"VLOOKUP($B20,'Feed Ingredients'!$A$2:$AH$125,(AA$4), FALSE)","v":0},{"$f":"VLOOKUP($B20,'Feed Ingredients'!$A$2:$AH$125,(AB$4), FALSE)","v":0},{"$f":"VLOOKUP($B20,'Feed Ingredients'!$A$2:$AH$125,(AC$4), FALSE)","v":0},{"$f":"VLOOKUP($B20,'Feed Ingredients'!$A$2:$AH$125,(AD$4), FALSE)","v":0},{"$f":"VLOOKUP($B20,'Feed Ingredients'!$A$2:$AH$125,(AE$4), FALSE)","v":0},{"$f":"VLOOKUP($B20,'Feed Ingredients'!$A$2:$AH$125,(AF$4), FALSE)","v":0},{"$f":"VLOOKUP($B20,'Feed Ingredients'!$A$2:$AH$125,(AG$4), FALSE)","v":0},{"$f":"VLOOKUP($B20,'Feed Ingredients'!$A$2:$AH$125,(AH$4), FALSE)","v":0},null,{"$f":"VLOOKUP($B20,'Feed Ingredients'!$A$2:$AH$125,(AJ$4), FALSE)","v":0}]
[{"$f":"INPUT!F20","v":0},{"$f":"INPUT!E20","v":"No feed"},{"$f":"VLOOKUP($B21,'Feed Ingredients'!$A$2:$AA$125,(C$4), FALSE)","v":0},{"$f":"VLOOKUP($B21,'Feed Ingredients'!$A$2:$AA$125,(D$4), FALSE)","v":0},{"$f":"VLOOKUP($B21,'Feed Ingredients'!$A$2:$AA$125,(E$4), FALSE)","v":0},{"$f":"VLOOKUP($B21,'Feed Ingredients'!$A$2:$AA$125,(F$4), FALSE)","v":0},{"$f":"VLOOKUP($B21,'Feed Ingredients'!$A$2:$AA$125,(G$4), FALSE)","v":0},{"$f":"VLOOKUP($B21,'Feed Ingredients'!$A$2:$AA$125,(H$4), FALSE)","v":0},{"$f":"VLOOKUP($B21,'Feed Ingredients'!$A$2:$AA$125,(I$4), FALSE)","v":0},{"$f":"VLOOKUP($B21,'Feed Ingredients'!$A$2:$AA$125,(J$4), FALSE)","v":0},{"$f":"VLOOKUP($B21,'Feed Ingredients'!$A$2:$AA$125,(K$4), FALSE)","v":0},{"$f":"VLOOKUP($B21,'Feed Ingredients'!$A$2:$AA$125,(L$4), FALSE)","v":0},{"$f":"VLOOKUP($B21,'Feed Ingredients'!$A$2:$AA$125,(M$4), FALSE)","v":0},{"$f":"VLOOKUP($B21,'Feed Ingredients'!$A$2:$AA$125,(N$4), FALSE)","v":0},{"$f":"VLOOKUP($B21,'Feed Ingredients'!$A$2:$AA$125,(O$4), FALSE)","v":0},{"$f":"VLOOKUP($B21,'Feed Ingredients'!$A$2:$AA$125,(P$4), FALSE)","v":0},{"$f":"VLOOKUP($B21,'Feed Ingredients'!$A$2:$AA$125,(Q$4), FALSE)","v":0},{"$f":"VLOOKUP($B21,'Feed Ingredients'!$A$2:$AA$125,(R$4), FALSE)","v":0},{"$f":"VLOOKUP($B21,'Feed Ingredients'!$A$2:$AA$125,(S$4), FALSE)","v":0},{"$f":"VLOOKUP($B21,'Feed Ingredients'!$A$2:$AA$125,(T$4), FALSE)","v":0},{"$f":"VLOOKUP($B21,'Feed Ingredients'!$A$2:$AA$125,(U$4), FALSE)","v":0},{"$f":"VLOOKUP($B21,'Feed Ingredients'!$A$2:$AA$125,(V$4), FALSE)","v":0},{"$f":"VLOOKUP($B21,'Feed Ingredients'!$A$2:$AA$125,(W$4), FALSE)","v":0},{"$f":"VLOOKUP($B21,'Feed Ingredients'!$A$2:$AA$125,(X$4), FALSE)","v":0},{"$f":"VLOOKUP($B21,'Feed Ingredients'!$A$2:$AA$125,(Y$4), FALSE)","v":0},{"$f":"VLOOKUP($B21,'Feed Ingredients'!$A$2:$AA$125,(Z$4), FALSE)","v":0},{"$f":"VLOOKUP($B21,'Feed Ingredients'!$A$2:$AH$125,(AA$4), FALSE)","v":0},{"$f":"VLOOKUP($B21,'Feed Ingredients'!$A$2:$AH$125,(AB$4), FALSE)","v":0},{"$f":"VLOOKUP($B21,'Feed Ingredients'!$A$2:$AH$125,(AC$4), FALSE)","v":0},{"$f":"VLOOKUP($B21,'Feed Ingredients'!$A$2:$AH$125,(AD$4), FALSE)","v":0},{"$f":"VLOOKUP($B21,'Feed Ingredients'!$A$2:$AH$125,(AE$4), FALSE)","v":0},{"$f":"VLOOKUP($B21,'Feed Ingredients'!$A$2:$AH$125,(AF$4), FALSE)","v":0},{"$f":"VLOOKUP($B21,'Feed Ingredients'!$A$2:$AH$125,(AG$4), FALSE)","v":0},{"$f":"VLOOKUP($B21,'Feed Ingredients'!$A$2:$AH$125,(AH$4), FALSE)","v":0},null,{"$f":"VLOOKUP($B21,'Feed Ingredients'!$A$2:$AH$125,(AJ$4), FALSE)","v":0}]
[{"$f":"INPUT!F21","v":0},{"$f":"INPUT!E21","v":"No feed"},{"$f":"VLOOKUP($B22,'Feed Ingredients'!$A$2:$AA$125,(C$4), FALSE)","v":0},{"$f":"VLOOKUP($B22,'Feed Ingredients'!$A$2:$AA$125,(D$4), FALSE)","v":0},{"$f":"VLOOKUP($B22,'Feed Ingredients'!$A$2:$AA$125,(E$4), FALSE)","v":0},{"$f":"VLOOKUP($B22,'Feed Ingredients'!$A$2:$AA$125,(F$4), FALSE)","v":0},{"$f":"VLOOKUP($B22,'Feed Ingredients'!$A$2:$AA$125,(G$4), FALSE)","v":0},{"$f":"VLOOKUP($B22,'Feed Ingredients'!$A$2:$AA$125,(H$4), FALSE)","v":0},{"$f":"VLOOKUP($B22,'Feed Ingredients'!$A$2:$AA$125,(I$4), FALSE)","v":0},{"$f":"VLOOKUP($B22,'Feed Ingredients'!$A$2:$AA$125,(J$4), FALSE)","v":0},{"$f":"VLOOKUP($B22,'Feed Ingredients'!$A$2:$AA$125,(K$4), FALSE)","v":0},{"$f":"VLOOKUP($B22,'Feed Ingredients'!$A$2:$AA$125,(L$4), FALSE)","v":0},{"$f":"VLOOKUP($B22,'Feed Ingredients'!$A$2:$AA$125,(M$4), FALSE)","v":0},{"$f":"VLOOKUP($B22,'Feed Ingredients'!$A$2:$AA$125,(N$4), FALSE)","v":0},{"$f":"VLOOKUP($B22,'Feed Ingredients'!$A$2:$AA$125,(O$4), FALSE)","v":0},{"$f":"VLOOKUP($B22,'Feed Ingredients'!$A$2:$AA$125,(P$4), FALSE)","v":0},{"$f":"VLOOKUP($B22,'Feed Ingredients'!$A$2:$AA$125,(Q$4), FALSE)","v":0},{"$f":"VLOOKUP($B22,'Feed Ingredients'!$A$2:$AA$125,(R$4), FALSE)","v":0},{"$f":"VLOOKUP($B22,'Feed Ingredients'!$A$2:$AA$125,(S$4), FALSE)","v":0},{"$f":"VLOOKUP($B22,'Feed Ingredients'!$A$2:$AA$125,(T$4), FALSE)","v":0},{"$f":"VLOOKUP($B22,'Feed Ingredients'!$A$2:$AA$125,(U$4), FALSE)","v":0},{"$f":"VLOOKUP($B22,'Feed Ingredients'!$A$2:$AA$125,(V$4), FALSE)","v":0},{"$f":"VLOOKUP($B22,'Feed Ingredients'!$A$2:$AA$125,(W$4), FALSE)","v":0},{"$f":"VLOOKUP($B22,'Feed Ingredients'!$A$2:$AA$125,(X$4), FALSE)","v":0},{"$f":"VLOOKUP($B22,'Feed Ingredients'!$A$2:$AA$125,(Y$4), FALSE)","v":0},{"$f":"VLOOKUP($B22,'Feed Ingredients'!$A$2:$AA$125,(Z$4), FALSE)","v":0},{"$f":"VLOOKUP($B22,'Feed Ingredients'!$A$2:$AH$125,(AA$4), FALSE)","v":0},{"$f":"VLOOKUP($B22,'Feed Ingredients'!$A$2:$AH$125,(AB$4), FALSE)","v":0},{"$f":"VLOOKUP($B22,'Feed Ingredients'!$A$2:$AH$125,(AC$4), FALSE)","v":0},{"$f":"VLOOKUP($B22,'Feed Ingredients'!$A$2:$AH$125,(AD$4), FALSE)","v":0},{"$f":"VLOOKUP($B22,'Feed Ingredients'!$A$2:$AH$125,(AE$4), FALSE)","v":0},{"$f":"VLOOKUP($B22,'Feed Ingredients'!$A$2:$AH$125,(AF$4), FALSE)","v":0},{"$f":"VLOOKUP($B22,'Feed Ingredients'!$A$2:$AH$125,(AG$4), FALSE)","v":0},{"$f":"VLOOKUP($B22,'Feed Ingredients'!$A$2:$AH$125,(AH$4), FALSE)","v":0},null,{"$f":"VLOOKUP($B22,'Feed Ingredients'!$A$2:$AH$125,(AJ$4), FALSE)","v":0}]
[{"$f":"INPUT!F22","v":0},{"$f":"INPUT!E22","v":"No feed"},{"$f":"VLOOKUP($B23,'Feed Ingredients'!$A$2:$AA$125,(C$4), FALSE)","v":0},{"$f":"VLOOKUP($B23,'Feed Ingredients'!$A$2:$AA$125,(D$4), FALSE)","v":0},{"$f":"VLOOKUP($B23,'Feed Ingredients'!$A$2:$AA$125,(E$4), FALSE)","v":0},{"$f":"VLOOKUP($B23,'Feed Ingredients'!$A$2:$AA$125,(F$4), FALSE)","v":0},{"$f":"VLOOKUP($B23,'Feed Ingredients'!$A$2:$AA$125,(G$4), FALSE)","v":0},{"$f":"VLOOKUP($B23,'Feed Ingredients'!$A$2:$AA$125,(H$4), FALSE)","v":0},{"$f":"VLOOKUP($B23,'Feed Ingredients'!$A$2:$AA$125,(I$4), FALSE)","v":0},{"$f":"VLOOKUP($B23,'Feed Ingredients'!$A$2:$AA$125,(J$4), FALSE)","v":0},{"$f":"VLOOKUP($B23,'Feed Ingredients'!$A$2:$AA$125,(K$4), FALSE)","v":0},{"$f":"VLOOKUP($B23,'Feed Ingredients'!$A$2:$AA$125,(L$4), FALSE)","v":0},{"$f":"VLOOKUP($B23,'Feed Ingredients'!$A$2:$AA$125,(M$4), FALSE)","v":0},{"$f":"VLOOKUP($B23,'Feed Ingredients'!$A$2:$AA$125,(N$4), FALSE)","v":0},{"$f":"VLOOKUP($B23,'Feed Ingredients'!$A$2:$AA$125,(O$4), FALSE)","v":0},{"$f":"VLOOKUP($B23,'Feed Ingredients'!$A$2:$AA$125,(P$4), FALSE)","v":0},{"$f":"VLOOKUP($B23,'Feed Ingredients'!$A$2:$AA$125,(Q$4), FALSE)","v":0},{"$f":"VLOOKUP($B23,'Feed Ingredients'!$A$2:$AA$125,(R$4), FALSE)","v":0},{"$f":"VLOOKUP($B23,'Feed Ingredients'!$A$2:$AA$125,(S$4), FALSE)","v":0},{"$f":"VLOOKUP($B23,'Feed Ingredients'!$A$2:$AA$125,(T$4), FALSE)","v":0},{"$f":"VLOOKUP($B23,'Feed Ingredients'!$A$2:$AA$125,(U$4), FALSE)","v":0},{"$f":"VLOOKUP($B23,'Feed Ingredients'!$A$2:$AA$125,(V$4), FALSE)","v":0},{"$f":"VLOOKUP($B23,'Feed Ingredients'!$A$2:$AA$125,(W$4), FALSE)","v":0},{"$f":"VLOOKUP($B23,'Feed Ingredients'!$A$2:$AA$125,(X$4), FALSE)","v":0},{"$f":"VLOOKUP($B23,'Feed Ingredients'!$A$2:$AA$125,(Y$4), FALSE)","v":0},{"$f":"VLOOKUP($B23,'Feed Ingredients'!$A$2:$AA$125,(Z$4), FALSE)","v":0},{"$f":"VLOOKUP($B23,'Feed Ingredients'!$A$2:$AH$125,(AA$4), FALSE)","v":0},{"$f":"VLOOKUP($B23,'Feed Ingredients'!$A$2:$AH$125,(AB$4), FALSE)","v":0},{"$f":"VLOOKUP($B23,'Feed Ingredients'!$A$2:$AH$125,(AC$4), FALSE)","v":0},{"$f":"VLOOKUP($B23,'Feed Ingredients'!$A$2:$AH$125,(AD$4), FALSE)","v":0},{"$f":"VLOOKUP($B23,'Feed Ingredients'!$A$2:$AH$125,(AE$4), FALSE)","v":0},{"$f":"VLOOKUP($B23,'Feed Ingredients'!$A$2:$AH$125,(AF$4), FALSE)","v":0},{"$f":"VLOOKUP($B23,'Feed Ingredients'!$A$2:$AH$125,(AG$4), FALSE)","v":0},{"$f":"VLOOKUP($B23,'Feed Ingredients'!$A$2:$AH$125,(AH$4), FALSE)","v":0},null,{"$f":"VLOOKUP($B23,'Feed Ingredients'!$A$2:$AH$125,(AJ$4), FALSE)","v":0}]
[{"$f":"INPUT!F23","v":0},{"$f":"INPUT!E23","v":"No feed"},{"$f":"VLOOKUP($B24,'Feed Ingredients'!$A$2:$AA$125,(C$4), FALSE)","v":0},{"$f":"VLOOKUP($B24,'Feed Ingredients'!$A$2:$AA$125,(D$4), FALSE)","v":0},{"$f":"VLOOKUP($B24,'Feed Ingredients'!$A$2:$AA$125,(E$4), FALSE)","v":0},{"$f":"VLOOKUP($B24,'Feed Ingredients'!$A$2:$AA$125,(F$4), FALSE)","v":0},{"$f":"VLOOKUP($B24,'Feed Ingredients'!$A$2:$AA$125,(G$4), FALSE)","v":0},{"$f":"VLOOKUP($B24,'Feed Ingredients'!$A$2:$AA$125,(H$4), FALSE)","v":0},{"$f":"VLOOKUP($B24,'Feed Ingredients'!$A$2:$AA$125,(I$4), FALSE)","v":0},{"$f":"VLOOKUP($B24,'Feed Ingredients'!$A$2:$AA$125,(J$4), FALSE)","v":0},{"$f":"VLOOKUP($B24,'Feed Ingredients'!$A$2:$AA$125,(K$4), FALSE)","v":0},{"$f":"VLOOKUP($B24,'Feed Ingredients'!$A$2:$AA$125,(L$4), FALSE)","v":0},{"$f":"VLOOKUP($B24,'Feed Ingredients'!$A$2:$AA$125,(M$4), FALSE)","v":0},{"$f":"VLOOKUP($B24,'Feed Ingredients'!$A$2:$AA$125,(N$4), FALSE)","v":0},{"$f":"VLOOKUP($B24,'Feed Ingredients'!$A$2:$AA$125,(O$4), FALSE)","v":0},{"$f":"VLOOKUP($B24,'Feed Ingredients'!$A$2:$AA$125,(P$4), FALSE)","v":0},{"$f":"VLOOKUP($B24,'Feed Ingredients'!$A$2:$AA$125,(Q$4), FALSE)","v":0},{"$f":"VLOOKUP($B24,'Feed Ingredients'!$A$2:$AA$125,(R$4), FALSE)","v":0},{"$f":"VLOOKUP($B24,'Feed Ingredients'!$A$2:$AA$125,(S$4), FALSE)","v":0},{"$f":"VLOOKUP($B24,'Feed Ingredients'!$A$2:$AA$125,(T$4), FALSE)","v":0},{"$f":"VLOOKUP($B24,'Feed Ingredients'!$A$2:$AA$125,(U$4), FALSE)","v":0},{"$f":"VLOOKUP($B24,'Feed Ingredients'!$A$2:$AA$125,(V$4), FALSE)","v":0},{"$f":"VLOOKUP($B24,'Feed Ingredients'!$A$2:$AA$125,(W$4), FALSE)","v":0},{"$f":"VLOOKUP($B24,'Feed Ingredients'!$A$2:$AA$125,(X$4), FALSE)","v":0},{"$f":"VLOOKUP($B24,'Feed Ingredients'!$A$2:$AA$125,(Y$4), FALSE)","v":0},{"$f":"VLOOKUP($B24,'Feed Ingredients'!$A$2:$AA$125,(Z$4), FALSE)","v":0},{"$f":"VLOOKUP($B24,'Feed Ingredients'!$A$2:$AH$125,(AA$4), FALSE)","v":0},{"$f":"VLOOKUP($B24,'Feed Ingredients'!$A$2:$AH$125,(AB$4), FALSE)","v":0},{"$f":"VLOOKUP($B24,'Feed Ingredients'!$A$2:$AH$125,(AC$4), FALSE)","v":0},{"$f":"VLOOKUP($B24,'Feed Ingredients'!$A$2:$AH$125,(AD$4), FALSE)","v":0},{"$f":"VLOOKUP($B24,'Feed Ingredients'!$A$2:$AH$125,(AE$4), FALSE)","v":0},{"$f":"VLOOKUP($B24,'Feed Ingredients'!$A$2:$AH$125,(AF$4), FALSE)","v":0},{"$f":"VLOOKUP($B24,'Feed Ingredients'!$A$2:$AH$125,(AG$4), FALSE)","v":0},{"$f":"VLOOKUP($B24,'Feed Ingredients'!$A$2:$AH$125,(AH$4), FALSE)","v":0},null,{"$f":"VLOOKUP($B24,'Feed Ingredients'!$A$2:$AH$125,(AJ$4), FALSE)","v":0}]
[{"$f":"INPUT!F24","v":0},{"$f":"INPUT!E24","v":"No feed"},{"$f":"VLOOKUP($B25,'Feed Ingredients'!$A$2:$AA$125,(C$4), FALSE)","v":0},{"$f":"VLOOKUP($B25,'Feed Ingredients'!$A$2:$AA$125,(D$4), FALSE)","v":0},{"$f":"VLOOKUP($B25,'Feed Ingredients'!$A$2:$AA$125,(E$4), FALSE)","v":0},{"$f":"VLOOKUP($B25,'Feed Ingredients'!$A$2:$AA$125,(F$4), FALSE)","v":0},{"$f":"VLOOKUP($B25,'Feed Ingredients'!$A$2:$AA$125,(G$4), FALSE)","v":0},{"$f":"VLOOKUP($B25,'Feed Ingredients'!$A$2:$AA$125,(H$4), FALSE)","v":0},{"$f":"VLOOKUP($B25,'Feed Ingredients'!$A$2:$AA$125,(I$4), FALSE)","v":0},{"$f":"VLOOKUP($B25,'Feed Ingredients'!$A$2:$AA$125,(J$4), FALSE)","v":0},{"$f":"VLOOKUP($B25,'Feed Ingredients'!$A$2:$AA$125,(K$4), FALSE)","v":0},{"$f":"VLOOKUP($B25,'Feed Ingredients'!$A$2:$AA$125,(L$4), FALSE)","v":0},{"$f":"VLOOKUP($B25,'Feed Ingredients'!$A$2:$AA$125,(M$4), FALSE)","v":0},{"$f":"VLOOKUP($B25,'Feed Ingredients'!$A$2:$AA$125,(N$4), FALSE)","v":0},{"$f":"VLOOKUP($B25,'Feed Ingredients'!$A$2:$AA$125,(O$4), FALSE)","v":0},{"$f":"VLOOKUP($B25,'Feed Ingredients'!$A$2:$AA$125,(P$4), FALSE)","v":0},{"$f":"VLOOKUP($B25,'Feed Ingredients'!$A$2:$AA$125,(Q$4), FALSE)","v":0},{"$f":"VLOOKUP($B25,'Feed Ingredients'!$A$2:$AA$125,(R$4), FALSE)","v":0},{"$f":"VLOOKUP($B25,'Feed Ingredients'!$A$2:$AA$125,(S$4), FALSE)","v":0},{"$f":"VLOOKUP($B25,'Feed Ingredients'!$A$2:$AA$125,(T$4), FALSE)","v":0},{"$f":"VLOOKUP($B25,'Feed Ingredients'!$A$2:$AA$125,(U$4), FALSE)","v":0},{"$f":"VLOOKUP($B25,'Feed Ingredients'!$A$2:$AA$125,(V$4), FALSE)","v":0},{"$f":"VLOOKUP($B25,'Feed Ingredients'!$A$2:$AA$125,(W$4), FALSE)","v":0},{"$f":"VLOOKUP($B25,'Feed Ingredients'!$A$2:$AA$125,(X$4), FALSE)","v":0},{"$f":"VLOOKUP($B25,'Feed Ingredients'!$A$2:$AA$125,(Y$4), FALSE)","v":0},{"$f":"VLOOKUP($B25,'Feed Ingredients'!$A$2:$AA$125,(Z$4), FALSE)","v":0},{"$f":"VLOOKUP($B25,'Feed Ingredients'!$A$2:$AH$125,(AA$4), FALSE)","v":0},{"$f":"VLOOKUP($B25,'Feed Ingredients'!$A$2:$AH$125,(AB$4), FALSE)","v":0},{"$f":"VLOOKUP($B25,'Feed Ingredients'!$A$2:$AH$125,(AC$4), FALSE)","v":0},{"$f":"VLOOKUP($B25,'Feed Ingredients'!$A$2:$AH$125,(AD$4), FALSE)","v":0},{"$f":"VLOOKUP($B25,'Feed Ingredients'!$A$2:$AH$125,(AE$4), FALSE)","v":0},{"$f":"VLOOKUP($B25,'Feed Ingredients'!$A$2:$AH$125,(AF$4), FALSE)","v":0},{"$f":"VLOOKUP($B25,'Feed Ingredients'!$A$2:$AH$125,(AG$4), FALSE)","v":0},{"$f":"VLOOKUP($B25,'Feed Ingredients'!$A$2:$AH$125,(AH$4), FALSE)","v":0},null,{"$f":"VLOOKUP($B25,'Feed Ingredients'!$A$2:$AH$125,(AJ$4), FALSE)","v":0}]
[{"$f":"INPUT!F25","v":0},{"$f":"INPUT!E25","v":"No feed"},{"$f":"VLOOKUP($B26,'Feed Ingredients'!$A$2:$AA$125,(C$4), FALSE)","v":0},{"$f":"VLOOKUP($B26,'Feed Ingredients'!$A$2:$AA$125,(D$4), FALSE)","v":0},{"$f":"VLOOKUP($B26,'Feed Ingredients'!$A$2:$AA$125,(E$4), FALSE)","v":0},{"$f":"VLOOKUP($B26,'Feed Ingredients'!$A$2:$AA$125,(F$4), FALSE)","v":0},{"$f":"VLOOKUP($B26,'Feed Ingredients'!$A$2:$AA$125,(G$4), FALSE)","v":0},{"$f":"VLOOKUP($B26,'Feed Ingredients'!$A$2:$AA$125,(H$4), FALSE)","v":0},{"$f":"VLOOKUP($B26,'Feed Ingredients'!$A$2:$AA$125,(I$4), FALSE)","v":0},{"$f":"VLOOKUP($B26,'Feed Ingredients'!$A$2:$AA$125,(J$4), FALSE)","v":0},{"$f":"VLOOKUP($B26,'Feed Ingredients'!$A$2:$AA$125,(K$4), FALSE)","v":0},{"$f":"VLOOKUP($B26,'Feed Ingredients'!$A$2:$AA$125,(L$4), FALSE)","v":0},{"$f":"VLOOKUP($B26,'Feed Ingredients'!$A$2:$AA$125,(M$4), FALSE)","v":0},{"$f":"VLOOKUP($B26,'Feed Ingredients'!$A$2:$AA$125,(N$4), FALSE)","v":0},{"$f":"VLOOKUP($B26,'Feed Ingredients'!$A$2:$AA$125,(O$4), FALSE)","v":0},{"$f":"VLOOKUP($B26,'Feed Ingredients'!$A$2:$AA$125,(P$4), FALSE)","v":0},{"$f":"VLOOKUP($B26,'Feed Ingredients'!$A$2:$AA$125,(Q$4), FALSE)","v":0},{"$f":"VLOOKUP($B26,'Feed Ingredients'!$A$2:$AA$125,(R$4), FALSE)","v":0},{"$f":"VLOOKUP($B26,'Feed Ingredients'!$A$2:$AA$125,(S$4), FALSE)","v":0},{"$f":"VLOOKUP($B26,'Feed Ingredients'!$A$2:$AA$125,(T$4), FALSE)","v":0},{"$f":"VLOOKUP($B26,'Feed Ingredients'!$A$2:$AA$125,(U$4), FALSE)","v":0},{"$f":"VLOOKUP($B26,'Feed Ingredients'!$A$2:$AA$125,(V$4), FALSE)","v":0},{"$f":"VLOOKUP($B26,'Feed Ingredients'!$A$2:$AA$125,(W$4), FALSE)","v":0},{"$f":"VLOOKUP($B26,'Feed Ingredients'!$A$2:$AA$125,(X$4), FALSE)","v":0},{"$f":"VLOOKUP($B26,'Feed Ingredients'!$A$2:$AA$125,(Y$4), FALSE)","v":0},{"$f":"VLOOKUP($B26,'Feed Ingredients'!$A$2:$AA$125,(Z$4), FALSE)","v":0},{"$f":"VLOOKUP($B26,'Feed Ingredients'!$A$2:$AH$125,(AA$4), FALSE)","v":0},{"$f":"VLOOKUP($B26,'Feed Ingredients'!$A$2:$AH$125,(AB$4), FALSE)","v":0},{"$f":"VLOOKUP($B26,'Feed Ingredients'!$A$2:$AH$125,(AC$4), FALSE)","v":0},{"$f":"VLOOKUP($B26,'Feed Ingredients'!$A$2:$AH$125,(AD$4), FALSE)","v":0},{"$f":"VLOOKUP($B26,'Feed Ingredients'!$A$2:$AH$125,(AE$4), FALSE)","v":0},{"$f":"VLOOKUP($B26,'Feed Ingredients'!$A$2:$AH$125,(AF$4), FALSE)","v":0},{"$f":"VLOOKUP($B26,'Feed Ingredients'!$A$2:$AH$125,(AG$4), FALSE)","v":0},{"$f":"VLOOKUP($B26,'Feed Ingredients'!$A$2:$AH$125,(AH$4), FALSE)","v":0},null,{"$f":"VLOOKUP($B26,'Feed Ingredients'!$A$2:$AH$125,(AJ$4), FALSE)","v":0}]
[{"$f":"INPUT!F26","v":0},{"$f":"INPUT!E26","v":"No feed"},{"$f":"VLOOKUP($B27,'Feed Ingredients'!$A$2:$AA$125,(C$4), FALSE)","v":0},{"$f":"VLOOKUP($B27,'Feed Ingredients'!$A$2:$AA$125,(D$4), FALSE)","v":0},{"$f":"VLOOKUP($B27,'Feed Ingredients'!$A$2:$AA$125,(E$4), FALSE)","v":0},{"$f":"VLOOKUP($B27,'Feed Ingredients'!$A$2:$AA$125,(F$4), FALSE)","v":0},{"$f":"VLOOKUP($B27,'Feed Ingredients'!$A$2:$AA$125,(G$4), FALSE)","v":0},{"$f":"VLOOKUP($B27,'Feed Ingredients'!$A$2:$AA$125,(H$4), FALSE)","v":0},{"$f":"VLOOKUP($B27,'Feed Ingredients'!$A$2:$AA$125,(I$4), FALSE)","v":0},{"$f":"VLOOKUP($B27,'Feed Ingredients'!$A$2:$AA$125,(J$4), FALSE)","v":0},{"$f":"VLOOKUP($B27,'Feed Ingredients'!$A$2:$AA$125,(K$4), FALSE)","v":0},{"$f":"VLOOKUP($B27,'Feed Ingredients'!$A$2:$AA$125,(L$4), FALSE)","v":0},{"$f":"VLOOKUP($B27,'Feed Ingredients'!$A$2:$AA$125,(M$4), FALSE)","v":0},{"$f":"VLOOKUP($B27,'Feed Ingredients'!$A$2:$AA$125,(N$4), FALSE)","v":0},{"$f":"VLOOKUP($B27,'Feed Ingredients'!$A$2:$AA$125,(O$4), FALSE)","v":0},{"$f":"VLOOKUP($B27,'Feed Ingredients'!$A$2:$AA$125,(P$4), FALSE)","v":0},{"$f":"VLOOKUP($B27,'Feed Ingredients'!$A$2:$AA$125,(Q$4), FALSE)","v":0},{"$f":"VLOOKUP($B27,'Feed Ingredients'!$A$2:$AA$125,(R$4), FALSE)","v":0},{"$f":"VLOOKUP($B27,'Feed Ingredients'!$A$2:$AA$125,(S$4), FALSE)","v":0},{"$f":"VLOOKUP($B27,'Feed Ingredients'!$A$2:$AA$125,(T$4), FALSE)","v":0},{"$f":"VLOOKUP($B27,'Feed Ingredients'!$A$2:$AA$125,(U$4), FALSE)","v":0},{"$f":"VLOOKUP($B27,'Feed Ingredients'!$A$2:$AA$125,(V$4), FALSE)","v":0},{"$f":"VLOOKUP($B27,'Feed Ingredients'!$A$2:$AA$125,(W$4), FALSE)","v":0},{"$f":"VLOOKUP($B27,'Feed Ingredients'!$A$2:$AA$125,(X$4), FALSE)","v":0},{"$f":"VLOOKUP($B27,'Feed Ingredients'!$A$2:$AA$125,(Y$4), FALSE)","v":0},{"$f":"VLOOKUP($B27,'Feed Ingredients'!$A$2:$AA$125,(Z$4), FALSE)","v":0},{"$f":"VLOOKUP($B27,'Feed Ingredients'!$A$2:$AH$125,(AA$4), FALSE)","v":0},{"$f":"VLOOKUP($B27,'Feed Ingredients'!$A$2:$AH$125,(AB$4), FALSE)","v":0},{"$f":"VLOOKUP($B27,'Feed Ingredients'!$A$2:$AH$125,(AC$4), FALSE)","v":0},{"$f":"VLOOKUP($B27,'Feed Ingredients'!$A$2:$AH$125,(AD$4), FALSE)","v":0},{"$f":"VLOOKUP($B27,'Feed Ingredients'!$A$2:$AH$125,(AE$4), FALSE)","v":0},{"$f":"VLOOKUP($B27,'Feed Ingredients'!$A$2:$AH$125,(AF$4), FALSE)","v":0},{"$f":"VLOOKUP($B27,'Feed Ingredients'!$A$2:$AH$125,(AG$4), FALSE)","v":0},{"$f":"VLOOKUP($B27,'Feed Ingredients'!$A$2:$AH$125,(AH$4), FALSE)","v":0},null,{"$f":"VLOOKUP($B27,'Feed Ingredients'!$A$2:$AH$125,(AJ$4), FALSE)","v":0}]
[{"$f":"INPUT!F27","v":0},{"$f":"INPUT!E27","v":"No feed"},{"$f":"VLOOKUP($B28,'Feed Ingredients'!$A$2:$AA$125,(C$4), FALSE)","v":0},{"$f":"VLOOKUP($B28,'Feed Ingredients'!$A$2:$AA$125,(D$4), FALSE)","v":0},{"$f":"VLOOKUP($B28,'Feed Ingredients'!$A$2:$AA$125,(E$4), FALSE)","v":0},{"$f":"VLOOKUP($B28,'Feed Ingredients'!$A$2:$AA$125,(F$4), FALSE)","v":0},{"$f":"VLOOKUP($B28,'Feed Ingredients'!$A$2:$AA$125,(G$4), FALSE)","v":0},{"$f":"VLOOKUP($B28,'Feed Ingredients'!$A$2:$AA$125,(H$4), FALSE)","v":0},{"$f":"VLOOKUP($B28,'Feed Ingredients'!$A$2:$AA$125,(I$4), FALSE)","v":0},{"$f":"VLOOKUP($B28,'Feed Ingredients'!$A$2:$AA$125,(J$4), FALSE)","v":0},{"$f":"VLOOKUP($B28,'Feed Ingredients'!$A$2:$AA$125,(K$4), FALSE)","v":0},{"$f":"VLOOKUP($B28,'Feed Ingredients'!$A$2:$AA$125,(L$4), FALSE)","v":0},{"$f":"VLOOKUP($B28,'Feed Ingredients'!$A$2:$AA$125,(M$4), FALSE)","v":0},{"$f":"VLOOKUP($B28,'Feed Ingredients'!$A$2:$AA$125,(N$4), FALSE)","v":0},{"$f":"VLOOKUP($B28,'Feed Ingredients'!$A$2:$AA$125,(O$4), FALSE)","v":0},{"$f":"VLOOKUP($B28,'Feed Ingredients'!$A$2:$AA$125,(P$4), FALSE)","v":0},{"$f":"VLOOKUP($B28,'Feed Ingredients'!$A$2:$AA$125,(Q$4), FALSE)","v":0},{"$f":"VLOOKUP($B28,'Feed Ingredients'!$A$2:$AA$125,(R$4), FALSE)","v":0},{"$f":"VLOOKUP($B28,'Feed Ingredients'!$A$2:$AA$125,(S$4), FALSE)","v":0},{"$f":"VLOOKUP($B28,'Feed Ingredients'!$A$2:$AA$125,(T$4), FALSE)","v":0},{"$f":"VLOOKUP($B28,'Feed Ingredients'!$A$2:$AA$125,(U$4), FALSE)","v":0},{"$f":"VLOOKUP($B28,'Feed Ingredients'!$A$2:$AA$125,(V$4), FALSE)","v":0},{"$f":"VLOOKUP($B28,'Feed Ingredients'!$A$2:$AA$125,(W$4), FALSE)","v":0},{"$f":"VLOOKUP($B28,'Feed Ingredients'!$A$2:$AA$125,(X$4), FALSE)","v":0},{"$f":"VLOOKUP($B28,'Feed Ingredients'!$A$2:$AA$125,(Y$4), FALSE)","v":0},{"$f":"VLOOKUP($B28,'Feed Ingredients'!$A$2:$AA$125,(Z$4), FALSE)","v":0},{"$f":"VLOOKUP($B28,'Feed Ingredients'!$A$2:$AH$125,(AA$4), FALSE)","v":0},{"$f":"VLOOKUP($B28,'Feed Ingredients'!$A$2:$AH$125,(AB$4), FALSE)","v":0},{"$f":"VLOOKUP($B28,'Feed Ingredients'!$A$2:$AH$125,(AC$4), FALSE)","v":0},{"$f":"VLOOKUP($B28,'Feed Ingredients'!$A$2:$AH$125,(AD$4), FALSE)","v":0},{"$f":"VLOOKUP($B28,'Feed Ingredients'!$A$2:$AH$125,(AE$4), FALSE)","v":0},{"$f":"VLOOKUP($B28,'Feed Ingredients'!$A$2:$AH$125,(AF$4), FALSE)","v":0},{"$f":"VLOOKUP($B28,'Feed Ingredients'!$A$2:$AH$125,(AG$4), FALSE)","v":0},{"$f":"VLOOKUP($B28,'Feed Ingredients'!$A$2:$AH$125,(AH$4), FALSE)","v":0},null,{"$f":"VLOOKUP($B28,'Feed Ingredients'!$A$2:$AH$125,(AJ$4), FALSE)","v":0}]
[{"$f":"INPUT!F28","v":0},{"$f":"INPUT!E28","v":"No feed"},{"$f":"VLOOKUP($B29,'Feed Ingredients'!$A$2:$AA$125,(C$4), FALSE)","v":0},{"$f":"VLOOKUP($B29,'Feed Ingredients'!$A$2:$AA$125,(D$4), FALSE)","v":0},{"$f":"VLOOKUP($B29,'Feed Ingredients'!$A$2:$AA$125,(E$4), FALSE)","v":0},{"$f":"VLOOKUP($B29,'Feed Ingredients'!$A$2:$AA$125,(F$4), FALSE)","v":0},{"$f":"VLOOKUP($B29,'Feed Ingredients'!$A$2:$AA$125,(G$4), FALSE)","v":0},{"$f":"VLOOKUP($B29,'Feed Ingredients'!$A$2:$AA$125,(H$4), FALSE)","v":0},{"$f":"VLOOKUP($B29,'Feed Ingredients'!$A$2:$AA$125,(I$4), FALSE)","v":0},{"$f":"VLOOKUP($B29,'Feed Ingredients'!$A$2:$AA$125,(J$4), FALSE)","v":0},{"$f":"VLOOKUP($B29,'Feed Ingredients'!$A$2:$AA$125,(K$4), FALSE)","v":0},{"$f":"VLOOKUP($B29,'Feed Ingredients'!$A$2:$AA$125,(L$4), FALSE)","v":0},{"$f":"VLOOKUP($B29,'Feed Ingredients'!$A$2:$AA$125,(M$4), FALSE)","v":0},{"$f":"VLOOKUP($B29,'Feed Ingredients'!$A$2:$AA$125,(N$4), FALSE)","v":0},{"$f":"VLOOKUP($B29,'Feed Ingredients'!$A$2:$AA$125,(O$4), FALSE)","v":0},{"$f":"VLOOKUP($B29,'Feed Ingredients'!$A$2:$AA$125,(P$4), FALSE)","v":0},{"$f":"VLOOKUP($B29,'Feed Ingredients'!$A$2:$AA$125,(Q$4), FALSE)","v":0},{"$f":"VLOOKUP($B29,'Feed Ingredients'!$A$2:$AA$125,(R$4), FALSE)","v":0},{"$f":"VLOOKUP($B29,'Feed Ingredients'!$A$2:$AA$125,(S$4), FALSE)","v":0},{"$f":"VLOOKUP($B29,'Feed Ingredients'!$A$2:$AA$125,(T$4), FALSE)","v":0},{"$f":"VLOOKUP($B29,'Feed Ingredients'!$A$2:$AA$125,(U$4), FALSE)","v":0},{"$f":"VLOOKUP($B29,'Feed Ingredients'!$A$2:$AA$125,(V$4), FALSE)","v":0},{"$f":"VLOOKUP($B29,'Feed Ingredients'!$A$2:$AA$125,(W$4), FALSE)","v":0},{"$f":"VLOOKUP($B29,'Feed Ingredients'!$A$2:$AA$125,(X$4), FALSE)","v":0},{"$f":"VLOOKUP($B29,'Feed Ingredients'!$A$2:$AA$125,(Y$4), FALSE)","v":0},{"$f":"VLOOKUP($B29,'Feed Ingredients'!$A$2:$AA$125,(Z$4), FALSE)","v":0},{"$f":"VLOOKUP($B29,'Feed Ingredients'!$A$2:$AH$125,(AA$4), FALSE)","v":0},{"$f":"VLOOKUP($B29,'Feed Ingredients'!$A$2:$AH$125,(AB$4), FALSE)","v":0},{"$f":"VLOOKUP($B29,'Feed Ingredients'!$A$2:$AH$125,(AC$4), FALSE)","v":0},{"$f":"VLOOKUP($B29,'Feed Ingredients'!$A$2:$AH$125,(AD$4), FALSE)","v":0},{"$f":"VLOOKUP($B29,'Feed Ingredients'!$A$2:$AH$125,(AE$4), FALSE)","v":0},{"$f":"VLOOKUP($B29,'Feed Ingredients'!$A$2:$AH$125,(AF$4), FALSE)","v":0},{"$f":"VLOOKUP($B29,'Feed Ingredients'!$A$2:$AH$125,(AG$4), FALSE)","v":0},{"$f":"VLOOKUP($B29,'Feed Ingredients'!$A$2:$AH$125,(AH$4), FALSE)","v":0},null,{"$f":"VLOOKUP($B29,'Feed Ingredients'!$A$2:$AH$125,(AJ$4), FALSE)","v":0}]
[{"$f":"INPUT!F29","v":0},{"$f":"INPUT!E29","v":"No feed"},{"$f":"VLOOKUP($B30,'Feed Ingredients'!$A$2:$AA$125,(C$4), FALSE)","v":0},{"$f":"VLOOKUP($B30,'Feed Ingredients'!$A$2:$AA$125,(D$4), FALSE)","v":0},{"$f":"VLOOKUP($B30,'Feed Ingredients'!$A$2:$AA$125,(E$4), FALSE)","v":0},{"$f":"VLOOKUP($B30,'Feed Ingredients'!$A$2:$AA$125,(F$4), FALSE)","v":0},{"$f":"VLOOKUP($B30,'Feed Ingredients'!$A$2:$AA$125,(G$4), FALSE)","v":0},{"$f":"VLOOKUP($B30,'Feed Ingredients'!$A$2:$AA$125,(H$4), FALSE)","v":0},{"$f":"VLOOKUP($B30,'Feed Ingredients'!$A$2:$AA$125,(I$4), FALSE)","v":0},{"$f":"VLOOKUP($B30,'Feed Ingredients'!$A$2:$AA$125,(J$4), FALSE)","v":0},{"$f":"VLOOKUP($B30,'Feed Ingredients'!$A$2:$AA$125,(K$4), FALSE)","v":0},{"$f":"VLOOKUP($B30,'Feed Ingredients'!$A$2:$AA$125,(L$4), FALSE)","v":0},{"$f":"VLOOKUP($B30,'Feed Ingredients'!$A$2:$AA$125,(M$4), FALSE)","v":0},{"$f":"VLOOKUP($B30,'Feed Ingredients'!$A$2:$AA$125,(N$4), FALSE)","v":0},{"$f":"VLOOKUP($B30,'Feed Ingredients'!$A$2:$AA$125,(O$4), FALSE)","v":0},{"$f":"VLOOKUP($B30,'Feed Ingredients'!$A$2:$AA$125,(P$4), FALSE)","v":0},{"$f":"VLOOKUP($B30,'Feed Ingredients'!$A$2:$AA$125,(Q$4), FALSE)","v":0},{"$f":"VLOOKUP($B30,'Feed Ingredients'!$A$2:$AA$125,(R$4), FALSE)","v":0},{"$f":"VLOOKUP($B30,'Feed Ingredients'!$A$2:$AA$125,(S$4), FALSE)","v":0},{"$f":"VLOOKUP($B30,'Feed Ingredients'!$A$2:$AA$125,(T$4), FALSE)","v":0},{"$f":"VLOOKUP($B30,'Feed Ingredients'!$A$2:$AA$125,(U$4), FALSE)","v":0},{"$f":"VLOOKUP($B30,'Feed Ingredients'!$A$2:$AA$125,(V$4), FALSE)","v":0},{"$f":"VLOOKUP($B30,'Feed Ingredients'!$A$2:$AA$125,(W$4), FALSE)","v":0},{"$f":"VLOOKUP($B30,'Feed Ingredients'!$A$2:$AA$125,(X$4), FALSE)","v":0},{"$f":"VLOOKUP($B30,'Feed Ingredients'!$A$2:$AA$125,(Y$4), FALSE)","v":0},{"$f":"VLOOKUP($B30,'Feed Ingredients'!$A$2:$AA$125,(Z$4), FALSE)","v":0},{"$f":"VLOOKUP($B30,'Feed Ingredients'!$A$2:$AH$125,(AA$4), FALSE)","v":0},{"$f":"VLOOKUP($B30,'Feed Ingredients'!$A$2:$AH$125,(AB$4), FALSE)","v":0},{"$f":"VLOOKUP($B30,'Feed Ingredients'!$A$2:$AH$125,(AC$4), FALSE)","v":0},{"$f":"VLOOKUP($B30,'Feed Ingredients'!$A$2:$AH$125,(AD$4), FALSE)","v":0},{"$f":"VLOOKUP($B30,'Feed Ingredients'!$A$2:$AH$125,(AE$4), FALSE)","v":0},{"$f":"VLOOKUP($B30,'Feed Ingredients'!$A$2:$AH$125,(AF$4), FALSE)","v":0},{"$f":"VLOOKUP($B30,'Feed Ingredients'!$A$2:$AH$125,(AG$4), FALSE)","v":0},{"$f":"VLOOKUP($B30,'Feed Ingredients'!$A$2:$AH$125,(AH$4), FALSE)","v":0},null,{"$f":"VLOOKUP($B30,'Feed Ingredients'!$A$2:$AH$125,(AJ$4), FALSE)","v":0}]
[{"$f":"INPUT!F30","v":0},{"$f":"INPUT!E30","v":"No feed"},{"$f":"VLOOKUP($B31,'Feed Ingredients'!$A$2:$AA$125,(C$4), FALSE)","v":0},{"$f":"VLOOKUP($B31,'Feed Ingredients'!$A$2:$AA$125,(D$4), FALSE)","v":0},{"$f":"VLOOKUP($B31,'Feed Ingredients'!$A$2:$AA$125,(E$4), FALSE)","v":0},{"$f":"VLOOKUP($B31,'Feed Ingredients'!$A$2:$AA$125,(F$4), FALSE)","v":0},{"$f":"VLOOKUP($B31,'Feed Ingredients'!$A$2:$AA$125,(G$4), FALSE)","v":0},{"$f":"VLOOKUP($B31,'Feed Ingredients'!$A$2:$AA$125,(H$4), FALSE)","v":0},{"$f":"VLOOKUP($B31,'Feed Ingredients'!$A$2:$AA$125,(I$4), FALSE)","v":0},{"$f":"VLOOKUP($B31,'Feed Ingredients'!$A$2:$AA$125,(J$4), FALSE)","v":0},{"$f":"VLOOKUP($B31,'Feed Ingredients'!$A$2:$AA$125,(K$4), FALSE)","v":0},{"$f":"VLOOKUP($B31,'Feed Ingredients'!$A$2:$AA$125,(L$4), FALSE)","v":0},{"$f":"VLOOKUP($B31,'Feed Ingredients'!$A$2:$AA$125,(M$4), FALSE)","v":0},{"$f":"VLOOKUP($B31,'Feed Ingredients'!$A$2:$AA$125,(N$4), FALSE)","v":0},{"$f":"VLOOKUP($B31,'Feed Ingredients'!$A$2:$AA$125,(O$4), FALSE)","v":0},{"$f":"VLOOKUP($B31,'Feed Ingredients'!$A$2:$AA$125,(P$4), FALSE)","v":0},{"$f":"VLOOKUP($B31,'Feed Ingredients'!$A$2:$AA$125,(Q$4), FALSE)","v":0},{"$f":"VLOOKUP($B31,'Feed Ingredients'!$A$2:$AA$125,(R$4), FALSE)","v":0},{"$f":"VLOOKUP($B31,'Feed Ingredients'!$A$2:$AA$125,(S$4), FALSE)","v":0},{"$f":"VLOOKUP($B31,'Feed Ingredients'!$A$2:$AA$125,(T$4), FALSE)","v":0},{"$f":"VLOOKUP($B31,'Feed Ingredients'!$A$2:$AA$125,(U$4), FALSE)","v":0},{"$f":"VLOOKUP($B31,'Feed Ingredients'!$A$2:$AA$125,(V$4), FALSE)","v":0},{"$f":"VLOOKUP($B31,'Feed Ingredients'!$A$2:$AA$125,(W$4), FALSE)","v":0},{"$f":"VLOOKUP($B31,'Feed Ingredients'!$A$2:$AA$125,(X$4), FALSE)","v":0},{"$f":"VLOOKUP($B31,'Feed Ingredients'!$A$2:$AA$125,(Y$4), FALSE)","v":0},{"$f":"VLOOKUP($B31,'Feed Ingredients'!$A$2:$AA$125,(Z$4), FALSE)","v":0},{"$f":"VLOOKUP($B31,'Feed Ingredients'!$A$2:$AH$125,(AA$4), FALSE)","v":0},{"$f":"VLOOKUP($B31,'Feed Ingredients'!$A$2:$AH$125,(AB$4), FALSE)","v":0},{"$f":"VLOOKUP($B31,'Feed Ingredients'!$A$2:$AH$125,(AC$4), FALSE)","v":0},{"$f":"VLOOKUP($B31,'Feed Ingredients'!$A$2:$AH$125,(AD$4), FALSE)","v":0},{"$f":"VLOOKUP($B31,'Feed Ingredients'!$A$2:$AH$125,(AE$4), FALSE)","v":0},{"$f":"VLOOKUP($B31,'Feed Ingredients'!$A$2:$AH$125,(AF$4), FALSE)","v":0},{"$f":"VLOOKUP($B31,'Feed Ingredients'!$A$2:$AH$125,(AG$4), FALSE)","v":0},{"$f":"VLOOKUP($B31,'Feed Ingredients'!$A$2:$AH$125,(AH$4), FALSE)","v":0},null,{"$f":"VLOOKUP($B31,'Feed Ingredients'!$A$2:$AH$125,(AJ$4), FALSE)","v":0}]
[{"$f":"INPUT!F31","v":0},{"$f":"INPUT!E31","v":"No feed"},{"$f":"VLOOKUP($B32,'Feed Ingredients'!$A$2:$AA$125,(C$4), FALSE)","v":0},{"$f":"VLOOKUP($B32,'Feed Ingredients'!$A$2:$AA$125,(D$4), FALSE)","v":0},{"$f":"VLOOKUP($B32,'Feed Ingredients'!$A$2:$AA$125,(E$4), FALSE)","v":0},{"$f":"VLOOKUP($B32,'Feed Ingredients'!$A$2:$AA$125,(F$4), FALSE)","v":0},{"$f":"VLOOKUP($B32,'Feed Ingredients'!$A$2:$AA$125,(G$4), FALSE)","v":0},{"$f":"VLOOKUP($B32,'Feed Ingredients'!$A$2:$AA$125,(H$4), FALSE)","v":0},{"$f":"VLOOKUP($B32,'Feed Ingredients'!$A$2:$AA$125,(I$4), FALSE)","v":0},{"$f":"VLOOKUP($B32,'Feed Ingredients'!$A$2:$AA$125,(J$4), FALSE)","v":0},{"$f":"VLOOKUP($B32,'Feed Ingredients'!$A$2:$AA$125,(K$4), FALSE)","v":0},{"$f":"VLOOKUP($B32,'Feed Ingredients'!$A$2:$AA$125,(L$4), FALSE)","v":0},{"$f":"VLOOKUP($B32,'Feed Ingredients'!$A$2:$AA$125,(M$4), FALSE)","v":0},{"$f":"VLOOKUP($B32,'Feed Ingredients'!$A$2:$AA$125,(N$4), FALSE)","v":0},{"$f":"VLOOKUP($B32,'Feed Ingredients'!$A$2:$AA$125,(O$4), FALSE)","v":0},{"$f":"VLOOKUP($B32,'Feed Ingredients'!$A$2:$AA$125,(P$4), FALSE)","v":0},{"$f":"VLOOKUP($B32,'Feed Ingredients'!$A$2:$AA$125,(Q$4), FALSE)","v":0},{"$f":"VLOOKUP($B32,'Feed Ingredients'!$A$2:$AA$125,(R$4), FALSE)","v":0},{"$f":"VLOOKUP($B32,'Feed Ingredients'!$A$2:$AA$125,(S$4), FALSE)","v":0},{"$f":"VLOOKUP($B32,'Feed Ingredients'!$A$2:$AA$125,(T$4), FALSE)","v":0},{"$f":"VLOOKUP($B32,'Feed Ingredients'!$A$2:$AA$125,(U$4), FALSE)","v":0},{"$f":"VLOOKUP($B32,'Feed Ingredients'!$A$2:$AA$125,(V$4), FALSE)","v":0},{"$f":"VLOOKUP($B32,'Feed Ingredients'!$A$2:$AA$125,(W$4), FALSE)","v":0},{"$f":"VLOOKUP($B32,'Feed Ingredients'!$A$2:$AA$125,(X$4), FALSE)","v":0},{"$f":"VLOOKUP($B32,'Feed Ingredients'!$A$2:$AA$125,(Y$4), FALSE)","v":0},{"$f":"VLOOKUP($B32,'Feed Ingredients'!$A$2:$AA$125,(Z$4), FALSE)","v":0},{"$f":"VLOOKUP($B32,'Feed Ingredients'!$A$2:$AH$125,(AA$4), FALSE)","v":0},{"$f":"VLOOKUP($B32,'Feed Ingredients'!$A$2:$AH$125,(AB$4), FALSE)","v":0},{"$f":"VLOOKUP($B32,'Feed Ingredients'!$A$2:$AH$125,(AC$4), FALSE)","v":0},{"$f":"VLOOKUP($B32,'Feed Ingredients'!$A$2:$AH$125,(AD$4), FALSE)","v":0},{"$f":"VLOOKUP($B32,'Feed Ingredients'!$A$2:$AH$125,(AE$4), FALSE)","v":0},{"$f":"VLOOKUP($B32,'Feed Ingredients'!$A$2:$AH$125,(AF$4), FALSE)","v":0},{"$f":"VLOOKUP($B32,'Feed Ingredients'!$A$2:$AH$125,(AG$4), FALSE)","v":0},{"$f":"VLOOKUP($B32,'Feed Ingredients'!$A$2:$AH$125,(AH$4), FALSE)","v":0},null,{"$f":"VLOOKUP($B32,'Feed Ingredients'!$A$2:$AH$125,(AJ$4), FALSE)","v":0}]
[{"$f":"INPUT!F32","v":0},{"$f":"INPUT!E32","v":"No feed"},{"$f":"VLOOKUP($B33,'Feed Ingredients'!$A$2:$AA$125,(C$4), FALSE)","v":0},{"$f":"VLOOKUP($B33,'Feed Ingredients'!$A$2:$AA$125,(D$4), FALSE)","v":0},{"$f":"VLOOKUP($B33,'Feed Ingredients'!$A$2:$AA$125,(E$4), FALSE)","v":0},{"$f":"VLOOKUP($B33,'Feed Ingredients'!$A$2:$AA$125,(F$4), FALSE)","v":0},{"$f":"VLOOKUP($B33,'Feed Ingredients'!$A$2:$AA$125,(G$4), FALSE)","v":0},{"$f":"VLOOKUP($B33,'Feed Ingredients'!$A$2:$AA$125,(H$4), FALSE)","v":0},{"$f":"VLOOKUP($B33,'Feed Ingredients'!$A$2:$AA$125,(I$4), FALSE)","v":0},{"$f":"VLOOKUP($B33,'Feed Ingredients'!$A$2:$AA$125,(J$4), FALSE)","v":0},{"$f":"VLOOKUP($B33,'Feed Ingredients'!$A$2:$AA$125,(K$4), FALSE)","v":0},{"$f":"VLOOKUP($B33,'Feed Ingredients'!$A$2:$AA$125,(L$4), FALSE)","v":0},{"$f":"VLOOKUP($B33,'Feed Ingredients'!$A$2:$AA$125,(M$4), FALSE)","v":0},{"$f":"VLOOKUP($B33,'Feed Ingredients'!$A$2:$AA$125,(N$4), FALSE)","v":0},{"$f":"VLOOKUP($B33,'Feed Ingredients'!$A$2:$AA$125,(O$4), FALSE)","v":0},{"$f":"VLOOKUP($B33,'Feed Ingredients'!$A$2:$AA$125,(P$4), FALSE)","v":0},{"$f":"VLOOKUP($B33,'Feed Ingredients'!$A$2:$AA$125,(Q$4), FALSE)","v":0},{"$f":"VLOOKUP($B33,'Feed Ingredients'!$A$2:$AA$125,(R$4), FALSE)","v":0},{"$f":"VLOOKUP($B33,'Feed Ingredients'!$A$2:$AA$125,(S$4), FALSE)","v":0},{"$f":"VLOOKUP($B33,'Feed Ingredients'!$A$2:$AA$125,(T$4), FALSE)","v":0},{"$f":"VLOOKUP($B33,'Feed Ingredients'!$A$2:$AA$125,(U$4), FALSE)","v":0},{"$f":"VLOOKUP($B33,'Feed Ingredients'!$A$2:$AA$125,(V$4), FALSE)","v":0},{"$f":"VLOOKUP($B33,'Feed Ingredients'!$A$2:$AA$125,(W$4), FALSE)","v":0},{"$f":"VLOOKUP($B33,'Feed Ingredients'!$A$2:$AA$125,(X$4), FALSE)","v":0},{"$f":"VLOOKUP($B33,'Feed Ingredients'!$A$2:$AA$125,(Y$4), FALSE)","v":0},{"$f":"VLOOKUP($B33,'Feed Ingredients'!$A$2:$AA$125,(Z$4), FALSE)","v":0},{"$f":"VLOOKUP($B33,'Feed Ingredients'!$A$2:$AH$125,(AA$4), FALSE)","v":0},{"$f":"VLOOKUP($B33,'Feed Ingredients'!$A$2:$AH$125,(AB$4), FALSE)","v":0},{"$f":"VLOOKUP($B33,'Feed Ingredients'!$A$2:$AH$125,(AC$4), FALSE)","v":0},{"$f":"VLOOKUP($B33,'Feed Ingredients'!$A$2:$AH$125,(AD$4), FALSE)","v":0},{"$f":"VLOOKUP($B33,'Feed Ingredients'!$A$2:$AH$125,(AE$4), FALSE)","v":0},{"$f":"VLOOKUP($B33,'Feed Ingredients'!$A$2:$AH$125,(AF$4), FALSE)","v":0},{"$f":"VLOOKUP($B33,'Feed Ingredients'!$A$2:$AH$125,(AG$4), FALSE)","v":0},{"$f":"VLOOKUP($B33,'Feed Ingredients'!$A$2:$AH$125,(AH$4), FALSE)","v":0},null,{"$f":"VLOOKUP($B33,'Feed Ingredients'!$A$2:$AH$125,(AJ$4), FALSE)","v":0}]
[{"$f":"INPUT!F33","v":0},{"$f":"INPUT!E33","v":"No feed"},{"$f":"VLOOKUP($B34,'Feed Ingredients'!$A$2:$AA$125,(C$4), FALSE)","v":0},{"$f":"VLOOKUP($B34,'Feed Ingredients'!$A$2:$AA$125,(D$4), FALSE)","v":0},{"$f":"VLOOKUP($B34,'Feed Ingredients'!$A$2:$AA$125,(E$4), FALSE)","v":0},{"$f":"VLOOKUP($B34,'Feed Ingredients'!$A$2:$AA$125,(F$4), FALSE)","v":0},{"$f":"VLOOKUP($B34,'Feed Ingredients'!$A$2:$AA$125,(G$4), FALSE)","v":0},{"$f":"VLOOKUP($B34,'Feed Ingredients'!$A$2:$AA$125,(H$4), FALSE)","v":0},{"$f":"VLOOKUP($B34,'Feed Ingredients'!$A$2:$AA$125,(I$4), FALSE)","v":0},{"$f":"VLOOKUP($B34,'Feed Ingredients'!$A$2:$AA$125,(J$4), FALSE)","v":0},{"$f":"VLOOKUP($B34,'Feed Ingredients'!$A$2:$AA$125,(K$4), FALSE)","v":0},{"$f":"VLOOKUP($B34,'Feed Ingredients'!$A$2:$AA$125,(L$4), FALSE)","v":0},{"$f":"VLOOKUP($B34,'Feed Ingredients'!$A$2:$AA$125,(M$4), FALSE)","v":0},{"$f":"VLOOKUP($B34,'Feed Ingredients'!$A$2:$AA$125,(N$4), FALSE)","v":0},{"$f":"VLOOKUP($B34,'Feed Ingredients'!$A$2:$AA$125,(O$4), FALSE)","v":0},{"$f":"VLOOKUP($B34,'Feed Ingredients'!$A$2:$AA$125,(P$4), FALSE)","v":0},{"$f":"VLOOKUP($B34,'Feed Ingredients'!$A$2:$AA$125,(Q$4), FALSE)","v":0},{"$f":"VLOOKUP($B34,'Feed Ingredients'!$A$2:$AA$125,(R$4), FALSE)","v":0},{"$f":"VLOOKUP($B34,'Feed Ingredients'!$A$2:$AA$125,(S$4), FALSE)","v":0},{"$f":"VLOOKUP($B34,'Feed Ingredients'!$A$2:$AA$125,(T$4), FALSE)","v":0},{"$f":"VLOOKUP($B34,'Feed Ingredients'!$A$2:$AA$125,(U$4), FALSE)","v":0},{"$f":"VLOOKUP($B34,'Feed Ingredients'!$A$2:$AA$125,(V$4), FALSE)","v":0},{"$f":"VLOOKUP($B34,'Feed Ingredients'!$A$2:$AA$125,(W$4), FALSE)","v":0},{"$f":"VLOOKUP($B34,'Feed Ingredients'!$A$2:$AA$125,(X$4), FALSE)","v":0},{"$f":"VLOOKUP($B34,'Feed Ingredients'!$A$2:$AA$125,(Y$4), FALSE)","v":0},{"$f":"VLOOKUP($B34,'Feed Ingredients'!$A$2:$AA$125,(Z$4), FALSE)","v":0},{"$f":"VLOOKUP($B34,'Feed Ingredients'!$A$2:$AH$125,(AA$4), FALSE)","v":0},{"$f":"VLOOKUP($B34,'Feed Ingredients'!$A$2:$AH$125,(AB$4), FALSE)","v":0},{"$f":"VLOOKUP($B34,'Feed Ingredients'!$A$2:$AH$125,(AC$4), FALSE)","v":0},{"$f":"VLOOKUP($B34,'Feed Ingredients'!$A$2:$AH$125,(AD$4), FALSE)","v":0},{"$f":"VLOOKUP($B34,'Feed Ingredients'!$A$2:$AH$125,(AE$4), FALSE)","v":0},{"$f":"VLOOKUP($B34,'Feed Ingredients'!$A$2:$AH$125,(AF$4), FALSE)","v":0},{"$f":"VLOOKUP($B34,'Feed Ingredients'!$A$2:$AH$125,(AG$4), FALSE)","v":0},{"$f":"VLOOKUP($B34,'Feed Ingredients'!$A$2:$AH$125,(AH$4), FALSE)","v":0},null,{"$f":"VLOOKUP($B34,'Feed Ingredients'!$A$2:$AH$125,(AJ$4), FALSE)","v":0}]
[{"$f":"INPUT!F34","v":0},{"$f":"INPUT!E34","v":"No feed"},{"$f":"VLOOKUP($B35,'Feed Ingredients'!$A$2:$AA$125,(C$4), FALSE)","v":0},{"$f":"VLOOKUP($B35,'Feed Ingredients'!$A$2:$AA$125,(D$4), FALSE)","v":0},{"$f":"VLOOKUP($B35,'Feed Ingredients'!$A$2:$AA$125,(E$4), FALSE)","v":0},{"$f":"VLOOKUP($B35,'Feed Ingredients'!$A$2:$AA$125,(F$4), FALSE)","v":0},{"$f":"VLOOKUP($B35,'Feed Ingredients'!$A$2:$AA$125,(G$4), FALSE)","v":0},{"$f":"VLOOKUP($B35,'Feed Ingredients'!$A$2:$AA$125,(H$4), FALSE)","v":0},{"$f":"VLOOKUP($B35,'Feed Ingredients'!$A$2:$AA$125,(I$4), FALSE)","v":0},{"$f":"VLOOKUP($B35,'Feed Ingredients'!$A$2:$AA$125,(J$4), FALSE)","v":0},{"$f":"VLOOKUP($B35,'Feed Ingredients'!$A$2:$AA$125,(K$4), FALSE)","v":0},{"$f":"VLOOKUP($B35,'Feed Ingredients'!$A$2:$AA$125,(L$4), FALSE)","v":0},{"$f":"VLOOKUP($B35,'Feed Ingredients'!$A$2:$AA$125,(M$4), FALSE)","v":0},{"$f":"VLOOKUP($B35,'Feed Ingredients'!$A$2:$AA$125,(N$4), FALSE)","v":0},{"$f":"VLOOKUP($B35,'Feed Ingredients'!$A$2:$AA$125,(O$4), FALSE)","v":0},{"$f":"VLOOKUP($B35,'Feed Ingredients'!$A$2:$AA$125,(P$4), FALSE)","v":0},{"$f":"VLOOKUP($B35,'Feed Ingredients'!$A$2:$AA$125,(Q$4), FALSE)","v":0},{"$f":"VLOOKUP($B35,'Feed Ingredients'!$A$2:$AA$125,(R$4), FALSE)","v":0},{"$f":"VLOOKUP($B35,'Feed Ingredients'!$A$2:$AA$125,(S$4), FALSE)","v":0},{"$f":"VLOOKUP($B35,'Feed Ingredients'!$A$2:$AA$125,(T$4), FALSE)","v":0},{"$f":"VLOOKUP($B35,'Feed Ingredients'!$A$2:$AA$125,(U$4), FALSE)","v":0},{"$f":"VLOOKUP($B35,'Feed Ingredients'!$A$2:$AA$125,(V$4), FALSE)","v":0},{"$f":"VLOOKUP($B35,'Feed Ingredients'!$A$2:$AA$125,(W$4), FALSE)","v":0},{"$f":"VLOOKUP($B35,'Feed Ingredients'!$A$2:$AA$125,(X$4), FALSE)","v":0},{"$f":"VLOOKUP($B35,'Feed Ingredients'!$A$2:$AA$125,(Y$4), FALSE)","v":0},{"$f":"VLOOKUP($B35,'Feed Ingredients'!$A$2:$AA$125,(Z$4), FALSE)","v":0},{"$f":"VLOOKUP($B35,'Feed Ingredients'!$A$2:$AH$125,(AA$4), FALSE)","v":0},{"$f":"VLOOKUP($B35,'Feed Ingredients'!$A$2:$AH$125,(AB$4), FALSE)","v":0},{"$f":"VLOOKUP($B35,'Feed Ingredients'!$A$2:$AH$125,(AC$4), FALSE)","v":0},{"$f":"VLOOKUP($B35,'Feed Ingredients'!$A$2:$AH$125,(AD$4), FALSE)","v":0},{"$f":"VLOOKUP($B35,'Feed Ingredients'!$A$2:$AH$125,(AE$4), FALSE)","v":0},{"$f":"VLOOKUP($B35,'Feed Ingredients'!$A$2:$AH$125,(AF$4), FALSE)","v":0},{"$f":"VLOOKUP($B35,'Feed Ingredients'!$A$2:$AH$125,(AG$4), FALSE)","v":0},{"$f":"VLOOKUP($B35,'Feed Ingredients'!$A$2:$AH$125,(AH$4), FALSE)","v":0},null,{"$f":"VLOOKUP($B35,'Feed Ingredients'!$A$2:$AH$125,(AJ$4), FALSE)","v":0}]
[{"$f":"INPUT!F35","v":0},{"$f":"INPUT!E35","v":"No feed"},{"$f":"VLOOKUP($B36,'Feed Ingredients'!$A$2:$AA$125,(C$4), FALSE)","v":0},{"$f":"VLOOKUP($B36,'Feed Ingredients'!$A$2:$AA$125,(D$4), FALSE)","v":0},{"$f":"VLOOKUP($B36,'Feed Ingredients'!$A$2:$AA$125,(E$4), FALSE)","v":0},{"$f":"VLOOKUP($B36,'Feed Ingredients'!$A$2:$AA$125,(F$4), FALSE)","v":0},{"$f":"VLOOKUP($B36,'Feed Ingredients'!$A$2:$AA$125,(G$4), FALSE)","v":0},{"$f":"VLOOKUP($B36,'Feed Ingredients'!$A$2:$AA$125,(H$4), FALSE)","v":0},{"$f":"VLOOKUP($B36,'Feed Ingredients'!$A$2:$AA$125,(I$4), FALSE)","v":0},{"$f":"VLOOKUP($B36,'Feed Ingredients'!$A$2:$AA$125,(J$4), FALSE)","v":0},{"$f":"VLOOKUP($B36,'Feed Ingredients'!$A$2:$AA$125,(K$4), FALSE)","v":0},{"$f":"VLOOKUP($B36,'Feed Ingredients'!$A$2:$AA$125,(L$4), FALSE)","v":0},{"$f":"VLOOKUP($B36,'Feed Ingredients'!$A$2:$AA$125,(M$4), FALSE)","v":0},{"$f":"VLOOKUP($B36,'Feed Ingredients'!$A$2:$AA$125,(N$4), FALSE)","v":0},{"$f":"VLOOKUP($B36,'Feed Ingredients'!$A$2:$AA$125,(O$4), FALSE)","v":0},{"$f":"VLOOKUP($B36,'Feed Ingredients'!$A$2:$AA$125,(P$4), FALSE)","v":0},{"$f":"VLOOKUP($B36,'Feed Ingredients'!$A$2:$AA$125,(Q$4), FALSE)","v":0},{"$f":"VLOOKUP($B36,'Feed Ingredients'!$A$2:$AA$125,(R$4), FALSE)","v":0},{"$f":"VLOOKUP($B36,'Feed Ingredients'!$A$2:$AA$125,(S$4), FALSE)","v":0},{"$f":"VLOOKUP($B36,'Feed Ingredients'!$A$2:$AA$125,(T$4), FALSE)","v":0},{"$f":"VLOOKUP($B36,'Feed Ingredients'!$A$2:$AA$125,(U$4), FALSE)","v":0},{"$f":"VLOOKUP($B36,'Feed Ingredients'!$A$2:$AA$125,(V$4), FALSE)","v":0},{"$f":"VLOOKUP($B36,'Feed Ingredients'!$A$2:$AA$125,(W$4), FALSE)","v":0},{"$f":"VLOOKUP($B36,'Feed Ingredients'!$A$2:$AA$125,(X$4), FALSE)","v":0},{"$f":"VLOOKUP($B36,'Feed Ingredients'!$A$2:$AA$125,(Y$4), FALSE)","v":0},{"$f":"VLOOKUP($B36,'Feed Ingredients'!$A$2:$AA$125,(Z$4), FALSE)","v":0},{"$f":"VLOOKUP($B36,'Feed Ingredients'!$A$2:$AH$125,(AA$4), FALSE)","v":0},{"$f":"VLOOKUP($B36,'Feed Ingredients'!$A$2:$AH$125,(AB$4), FALSE)","v":0},{"$f":"VLOOKUP($B36,'Feed Ingredients'!$A$2:$AH$125,(AC$4), FALSE)","v":0},{"$f":"VLOOKUP($B36,'Feed Ingredients'!$A$2:$AH$125,(AD$4), FALSE)","v":0},{"$f":"VLOOKUP($B36,'Feed Ingredients'!$A$2:$AH$125,(AE$4), FALSE)","v":0},{"$f":"VLOOKUP($B36,'Feed Ingredients'!$A$2:$AH$125,(AF$4), FALSE)","v":0},{"$f":"VLOOKUP($B36,'Feed Ingredients'!$A$2:$AH$125,(AG$4), FALSE)","v":0},{"$f":"VLOOKUP($B36,'Feed Ingredients'!$A$2:$AH$125,(AH$4), FALSE)","v":0},null,{"$f":"VLOOKUP($B36,'Feed Ingredients'!$A$2:$AH$125,(AJ$4), FALSE)","v":0}]

{"sheet":"Min_Max","index":7,"n_rows":15,"n_cols":19,"rows_kept":15,"cut":false,"hidden":false,"merged":[[4,1,4,2]]}
["Min / Max Calculations"]
[null,null,null,null,null,null,null,null,null,null,"From Print_Tag",null,null,"Min","Max",null,null,null,"Beef Feed"]
["CF & ADF (rabbit)",null,null,null,"Max > min by not>",null,5,"% units",null,null,10.15,{"$f":"ROUND(K3,1)","v":10.199999999999999},null,{"$f":"L3-2.5","v":7.6999999999999993},{"$f":"L3+2.5","v":12.7},null,null,null,"Dairy Feed"]
[null,null,null,null,null,null,null,null,null,null,null,null,null,null,null,null,null,null,"Equine Feed"]
["Ca, Salt, Na","Range",null,null,null,null,null,null,null,null,null,null,null,null,null,null,null,null,"Swine Feed"]
[null,"Min","Max",null,null,null,null,null,null,null,"From Print_Tag",null,null,"Min","Max","+ / -",null,null,"Poultry Feed"]
["<2.5",0,2.4990000000000001,null,"Max > min by not>",null,0.5,"% units",null,null,2.35,{"$f":"ROUND(K7,1)","v":2.4},null,{"$f":"L7-(P7)","v":2.15},{"$f":"L7+(P7)","v":2.65},0.25,null,null,"Goat Feed"]
["2.5 - 5",2.5,5,null,"Max > min by not>",null,1,"% units",null,null,5,{"$f":"ROUND(K8,1)","v":5},null,{"$f":"L8-(P8)","v":4.5},{"$f":"L8+(P8)","v":5.5},0.5,null,null,"Sheep Feed"]
["5+",5.01,27.5,null,"Max > min by not>",null,5,"% units",null,null,26,{"$f":"ROUND(K9,1)","v":26},null,25.91,26.09,0.09,"Conc *0.09",null,"Rabbit Feed"]
["5+",27.51,100,null,"Max > min by not>",null,20,"% of min",null,null,27.5,{"$f":"ROUND(K10,1)","v":27.5},null,25,30,2.5,null,null,"Fish Feed"]
[null,null,null,null,null,null,null,null,null,null,null,null,null,null,null,null,null,null,"Deer Feed"]
["From Print_Tag",null,null,null,"+ / -",null,"Min","Max",null,null,null,null,null,null,null,null,null,null,"Deer Mineral"]
["Ca",{"$f":"Print_Tag!E14","v":0.66962500000000003},null,null,{"$f":"IF($B13>$B$10,$P$10,IF($B13>$B$9,($P$9*B13), IF($B13>$B$8,$P$8,$P$7)))","v":0.25},null,{"$f":"(ROUND(B13,1))-E13","v":0.44999999999999996},{"$f":"(ROUND(B13,1))+E13","v":0.95},null,null,null,null,null,null,null,null,null,null,"Mineral Feed"]
["Salt",{"$f":"Print_Tag!E16","v":0.99124999999999996},null,null,{"$f":"IF($B14>$B$10,$P$10,IF($B14>$B$9,($P$9*B14), IF($B14>$B$8,$P$8,$P$7)))","v":0.25},null,{"$f":"B14-E14","v":0.74124999999999996},{"$f":"B14+E14","v":1.24125},null,null,null,null,null,null,null,null,null,null,"Milk Replacer"]
["Na",{"$f":"Print_Tag!E17","v":0},null,null,{"$f":"IF($B15>$B$10,$P$10,IF($B15>$B$9,($P$9*B15), IF($B15>$B$8,$P$8,$P$7)))","v":0.25},null,-0.25,0.25]

{"sheet":"Drug_Calc2","index":8,"n_rows":37,"n_cols":14,"rows_kept":37,"cut":false,"hidden":false,"merged":[]}
["Insp. No.",{"$f":"'Calculation Sheet'!B1","v":0},"Mnfr. No.",null,{"$f":"'Calculation Sheet'!D1","v":0}]
[null,null,"Mnfr. Name",null,{"$f":"'Calculation Sheet'!D2","v":0}]
["Formula Weight lb.",{"$f":"'Calculation Sheet'!A4","v":2000},"Product",null,{"$f":"'Calculation Sheet'!D3","v":0}]
[]
[]
["Medication","g/ton","g/lb","mg/lb","%"]
["Chlortetracycline ",{"$f":"'Calculation Sheet'!AB6","v":0},{"$f":"B7/2000","v":0},{"$f":"C7*1000","v":0},{"$f":"(B7/453.54)/2000","v":0},null,null,{"$f":"IF(B7>0,1,0)","v":0}]
["Sulfamethazine",{"$f":"'Calculation Sheet'!AC6","v":0},{"$f":"B8/2000","v":0},{"$f":"C8*1000","v":0},{"$f":"(B8/453.54)/2000","v":0},null,null,{"$f":"IF(B8>0,1,0)","v":0}]
["Monensin",{"$f":"'Calculation Sheet'!AD6","v":0},0,0,0,null,null,0]
["Lasalocid ",{"$f":"'Calculation Sheet'!AE6","v":0},0,0,0,null,null,0]
["Deccox",{"$f":"'Calculation Sheet'!AF6","v":0},{"$f":"B11/2000","v":0},{"$f":"C11*1000","v":0},{"$f":"(B11/453.54)/2000","v":0},null,null,0]
["Bacitracin",{"$f":"'Calculation Sheet'!AG6","v":0},0,0,0,null,null,0]
["Amprolium",{"$f":"'Calculation Sheet'!AH6","v":0},{"$f":"B13/2000","v":0},{"$f":"C13*1000","v":0},{"$f":"(B13/453.54)/2000","v":0},null,null,{"$f":"IF(B13>0,1,0)","v":0}]
[]
[null,null,null,"Feed rate lb/d =",{"$f":"Printout!B34","v":5}]
["Chlortetracycline g/ton",{"$f":"B7","v":0},"Chlortetracycline mg/hd/d",null,{"$f":"E$15*D7","v":0}]
["Sulfamethazine g/ton",0,"Sulfamethazine mg/hd/d",null,0]
["Monensin g/ton",0,"Monensin mg/hd/d",null,0]
["Lasalocid g/ton",0,"Lasalocid mg/hd/d",null,0]
["Deccox g/ton",0,"Deccox mg/hd/d",null,0]
["Bacitracin g/ton",0,"Bacitracin mg/hd/d",null,0]
["Amprolium g/ton",0,"Amprolium mg/hd/d"," ",0]
[]
[null,null,null,null,"Med 1",{"$f":"VLOOKUP($C$27,$C$28:$N$37,4,0)","v":"None"},{"$f":"VLOOKUP($C$27,$C$28:$N$37,5,0)","v":" "},{"$f":"VLOOKUP($C$27,$C$28:$N$37,6,0)","v":" "},{"$f":"VLOOKUP($C$27,$C$28:$N$37,7,0)","v":" "}]
[null,null,null,null,"Med 2",{"$f":"VLOOKUP($C$27,$C$28:$N$37,9,0)","v":" "},{"$f":"VLOOKUP($C$27,$C$28:$N$37,10,0)","v":" "},{"$f":"VLOOKUP($C$27,$C$28:$N$37,11,0)","v":" "},{"$f":"VLOOKUP($C$27,$C$28:$N$37,12,0)","v":" "}]
[]
[null,null,{"$f":"MAX(C28:C37)","v":1}]
["No med",1,{"$f":"IF(SUM(H7:H13)<1,B28,0)","v":1},null,null,"None",{"$f":"\" \"","v":" "},{"$f":"\" \"","v":" "},{"$f":"\" \"","v":" "},null," "," "," "," "]
["CTC & no other med",2,{"$f":"IF(AND(H7=1,SUM(H$7:H$13)<2),B29,0)","v":0},null,null,{"$f":"A16","v":"Chlortetracycline g/ton"},{"$f":"B16","v":0},{"$f":"C16","v":"Chlortetracycline mg/hd/d"},{"$f":"E16","v":0},null," "," "," "," "]
["CTC & SMZ",3,{"$f":"IF(AND(H7=1,H8=1),B30,0)","v":0},null,null,{"$f":"A16","v":"Chlortetracycline g/ton"},{"$f":"B16","v":0},{"$f":"C16","v":"Chlortetracycline mg/hd/d"},{"$f":"E16","v":0},null,{"$f":"A17","v":"Sulfamethazine g/ton"},{"$f":"B17","v":0},{"$f":"C17","v":"Sulfamethazine mg/hd/d"},{"$f":"E17","v":0}]
["CTC & Lasalocid",4,{"$f":"IF(AND(H7=1,H10=1),B31,0)","v":0},null,null,{"$f":"A16","v":"Chlortetracycline g/ton"},0,"Chlortetracycline mg/hd/d",{"$f":"E16","v":0},null,{"$f":"A19","v":"Lasalocid g/ton"},{"$f":"B19","v":0},{"$f":"C19","v":"Lasalocid mg/hd/d"},{"$f":"E19","v":0}]
["SMZ & no other med",5,{"$f":"IF(AND(H10=1,SUM(H$7:H$13)<2),B32,0)","v":0},null,null,"Sulfamethazine g/ton",0,"Sulfamethazine mg/hd/d",0,null," "," "," "," "]
["Monensin & no other med",6,{"$f":"IF(AND(H9=1,SUM(H$7:H$13)<2),B33,0)","v":0},null,null,{"$f":"A18","v":"Monensin g/ton"},{"$f":"B18","v":0},{"$f":"C18","v":"Monensin mg/hd/d"},0,null," "," "," "," "]
["Lasalocid & no other med",7,{"$f":"IF(AND(H10=1,SUM(H$7:H$13)<2),B34,0)","v":0},null,null,{"$f":"A19","v":"Lasalocid g/ton"},0,{"$f":"C19","v":"Lasalocid mg/hd/d"},0,null," "," "," "," "]
["Deccox & no other med",8,{"$f":"IF(AND(H11=1,SUM(H$7:H$13)<2),B35,0)","v":0},null,null,{"$f":"A20","v":"Deccox g/ton"},0,"Deccox mg/hd/d",0,null," "," "," "," "]
["BMD & no other med",9,{"$f":"IF(AND(H12=1,SUM(H$7:H$13)<2),B36,0)","v":0},null,null,"Bacitracin g/ton",0,"Bacitracin mg/hd/d",0,null," "," "," "," "]
["Amprolium  & no other med",10,{"$f":"IF(AND(H13=1,SUM(H$7:H$13)<2),B37,0)","v":0},null,null,{"$f":"A22","v":"Amprolium g/ton"},{"$f":"B22","v":0},{"$f":"C22","v":"Amprolium mg/hd/d"},{"$f":"E22","v":0},null," "," "," "," "]